program: Gaussian 09
title: 000278206
version: EM64L-G09RevD.01
frameworkgroup: C1[X(C12H16O3)]
method: RPBEPBE
basis: SDD
operation: Freq
keyword: #pfreq=noraman
keyword: PBEPBE/SDD
title: #p freq=noraman PBEPBE/SDD
converged: YES YES NO NO
title: Mulliken charges:
elementType: O O O C C C C C C C C C C C C H H H H H H H H H H H H H H H H
charge: -0.272845 -0.229027 -0.235112 0.082926 -0.523947 0.491669 -0.502979 -0.456585 -0.560782 -0.520286 0.220116 -0.529817 0.178376 -0.265359 -0.663199 0.243555 0.230009 0.211356 0.237918 0.241663 0.224678 0.256498 0.232904 0.247843 0.239981 0.260677 0.234557 0.224489 0.220486 0.226675 0.253562
chargesum: 0.00000
title: Mulliken charges with hydrogens summed into heavy atoms:
elementType: O O O C C C C C C C C C C C C
charge: -0.272845 -0.229027 -0.235112 0.082926 -0.050383 0.491669 -0.053705 0.009756 -0.071380 -0.032462 0.220116 -0.269141 0.178376 0.193687 0.037524
polarizability: 1.39132184e+02 5.51506711e+00 1.50930765e+02 8.52881894e+00 -1.32422037e+00 1.08851772e+02
1716.lowfreq: -3.2053 -0.0009 -0.0008 -0.0006 4.8971 6.6377 29.8693 45.5813 69.4679
frequency: 28.9126 45.5781 69.3426 89.8660 117.0175 150.1614 162.0928 169.4091 216.0900 242.0902 266.6641 298.9940 325.2208 385.9920 409.8484 429.3579 445.4002 477.6137 520.0162 546.8185 586.0777 632.3988 682.8397 712.5598 730.0349 756.9590 786.0757 814.6819 818.3380 854.8936 875.5655 903.3289 912.2696 918.9511 982.4941 1009.6984 1020.2902 1027.9141 1058.8697 1061.3979 1094.4221 1098.2050 1116.6324 1134.1348 1154.3104 1156.4246 1181.4738 1209.5355 1218.1654 1244.0125 1265.1907 1271.5242 1280.0121 1286.4729 1309.8846 1315.5187 1335.7354 1344.2379 1356.2087 1393.8298 1437.5770 1440.7449 1455.6840 1463.1588 1466.9346 1472.3498 1477.8578 1485.5896 1582.8092 1609.6324 1654.6274 2974.0805 2993.5851 2993.7992 2995.2478 3002.6511 3022.2353 3030.0639 3047.8330 3064.7115 3069.8039 3079.0093 3087.8865 3088.0893 3094.1884 3119.8330 3131.9543
redmass: 5.4011 4.3125 3.4344 3.3955 2.5237 2.5373 4.0675 3.0692 1.7781 2.0079 1.9325 3.0545 2.8243 3.5819 5.4873 3.8747 4.2693 3.5941 2.7288 3.2471 2.5729 3.2918 3.1972 5.1177 3.4959 2.3325 2.0431 2.2470 1.4690 2.3712 1.9839 1.6492 1.8435 2.1369 2.1720 2.6354 2.2322 1.9246 2.4655 3.8720 2.2199 2.5184 2.8054 1.2082 1.6802 1.6151 1.8520 1.4055 1.7367 1.7058 1.8401 1.9579 1.1237 1.3745 1.3789 1.4571 1.9124 1.5215 1.2776 1.2294 1.0790 1.0791 1.1010 1.0840 1.0426 1.0845 1.0946 1.0515 10.0280 9.5888 8.8170 1.0667 1.0366 1.0610 1.0631 1.0638 1.0633 1.0594 1.0985 1.0939 1.1004 1.0990 1.1044 1.0981 1.1032 1.1062 1.0925
irintensity: 1.3333 2.1473 2.4899 0.9703 0.1439 1.1117 0.9459 3.8179 4.0361 0.2564 1.0143 6.7049 9.4279 7.9581 0.4234 8.9311 2.2842 2.5794 3.6417 3.9851 0.8211 5.6055 1.9916 3.5695 5.4378 7.4954 4.8574 5.6506 1.0388 0.7949 5.4425 4.9558 16.3325 16.6354 8.3187 28.4874 20.5696 0.7722 142.8031 4.5158 49.3390 0.6091 204.2532 0.2859 7.4936 9.6333 20.0825 6.1613 15.0513 41.2565 43.2121 10.0478 3.7490 8.9548 1.2329 3.6611 26.3360 1.5450 0.3977 24.2243 14.6871 11.6243 13.2252 1.9510 16.9398 25.4154 11.4715 15.7144 197.8489 127.1862 94.8606 9.5969 17.0011 19.7619 8.7459 44.7402 30.5812 32.2496 4.9276 19.7255 16.8345 18.1681 61.1493 18.4714 1.5989 29.0767 6.8978
temp: 298.150 k
press: 1.00000 atm
elementType: 8 8 8 6 6 6 6 6 6 6 6 6 6 6 6 1 1 1 1 1 1 1 1 1 1 1 1 1 1 1 1
symmnumber: 1
zpe: 673796.6 jmol-1
zpe.correction: 0.256636 hartree
zpe.thermalcorrener: 0.271244 hartree
zpe.thermalcorrenthalpy: 0.272188 hartree
zpe.thermalcorrgfe: 0.214324 hartree
zpe.sumelectzpe: -691.403387 hartree
zpe.sumelectthermal: -691.388778 hartree
zpe.sumelectthermalent: -691.387834 hartree
zpe.sumelectthermalfe: -691.445699 hartree
dipole: 3.0935 3.5789 2.3381
dipole: 5.2769
quadrupole: -84.5143 -96.0141 -91.0283
quadrupole: -14.9593 -1.2439 -2.0055
quadrupole: 6.0046 -5.4952 -0.5094 -14.9593 -1.2439 -2.0055
hfenergy: -691.6600225 hartree
pointgroup: C01 [X(C12H16O3)]
dipole: -1.4454614 1.318479 -0.6945439 debye
polarizability: 141.7316035|-6.9939216|148.6734413|5.0477623|6.3878853|108.5096762 unknown
InChI: InChI=1S/C12H16O3/c1-2-15-11(14)12-6-3-4-9(12)8-10(13)5-7-12/h8H,2-7H2,1H3
charge 0 multiplicity 1
31 atoms
O  -2.283691 -0.201108 -0.606557
O  -1.359655 0.472201 1.421747
O  2.706399 -2.557437 -0.047728
C  -0.006632 0.645684 -0.664698
C  -0.178743 2.135033 -1.131988
C  1.218028 0.749667 0.255302
C  0.245463 -0.381775 -1.792914
C  0.202953 2.974947 0.118221
C  1.334378 2.158615 0.816134
C  0.710861 -1.732138 -1.199827
C  -1.245606 0.289277 0.186752
C  2.093702 -0.284213 0.42293
C  1.908175 -1.591187 -0.247507
C  -3.565416 -0.531029 0.098693
C  -3.51775 -1.947846 0.675812
H  -1.192174 2.348593 -1.513399
H  0.538824 2.317019 -1.955455
H  1.036599 0.023086 -2.453778
H  -0.66503 -0.521911 -2.399161
H  -0.664129 3.064439 0.795338
H  0.526218 3.995358 -0.150234
H  1.22368 2.157389 1.915801
H  2.336875 2.572222 0.593809
H  0.988218 -2.45185 -1.989866
H  -0.120514 -2.197527 -0.629856
H  2.986695 -0.186261 1.052611
H  -3.730687 0.220085 0.890861
H  -4.325276 -0.428169 -0.692335
H  -4.498451 -2.20053 1.119971
H  -3.296068 -2.68906 -0.11143
H  -2.753848 -2.023172 1.467554
