program: Gaussian 09
title: 000278210
version: EM64L-G09RevD.01
frameworkgroup: C1[X(C14H20O2)]
method: RPBEPBE
basis: SDD
operation: Freq
keyword: #pfreq=noraman
keyword: PBEPBE/SDD
title: #p freq=noraman PBEPBE/SDD
converged: YES YES NO NO
title: Mulliken charges:
elementType: O O C C C C C C C C C C C C C C H H H H H H H H H H H H H H H H H H H H
charge: -0.215803 -0.200249 0.289744 -0.120989 -0.532039 -0.118394 0.283564 -0.651956 -0.462998 -0.600699 0.159534 -0.453875 -0.792094 -0.496315 0.172008 -0.821380 0.249287 0.239074 0.231638 0.257970 0.225379 0.222496 0.201964 0.208870 0.262322 0.264710 0.208915 0.207076 0.228906 0.220439 0.220226 0.216365 0.215644 0.228005 0.231536 0.221119
chargesum: 0.00000
title: Mulliken charges with hydrogens summed into heavy atoms:
elementType: O O C C C C C C C C C C C C C C
charge: -0.215803 -0.200249 0.289744 0.128297 -0.061327 0.139577 0.283564 -0.204081 -0.052165 -0.073667 0.159534 -0.037883 -0.122525 -0.064306 0.172008 -0.140720
polarizability: 1.71822609e+02 3.80769352e+00 1.47454520e+02 -2.32787500e+00 -4.88131162e+00 1.24522265e+02
1716.lowfreq: -8.7301 -7.7449 -0.0006 0.0003 0.0007 14.8851 51.1111 65.5886 108.3203
frequency: 50.9483 65.5372 108.3157 124.7072 135.8935 158.1554 197.1917 224.2556 241.7085 275.4765 304.1445 309.9502 362.1399 374.8424 388.1542 398.7425 417.4953 456.8164 473.0742 506.9574 522.9317 542.5412 588.5649 604.6530 619.0451 682.3227 696.8928 786.6230 791.3012 818.6911 847.3648 854.3998 877.7127 885.6388 923.7232 934.0334 946.6873 963.0988 982.2177 992.8591 1010.4343 1031.4536 1039.3914 1060.4250 1074.4338 1084.8640 1116.1743 1130.7283 1135.4346 1145.4781 1163.8386 1179.0511 1180.9861 1199.3621 1204.2920 1234.4072 1252.6298 1258.1038 1275.2645 1291.4298 1296.6243 1326.0763 1334.3701 1339.9381 1341.3060 1350.1159 1364.5488 1367.6083 1385.4122 1394.5610 1447.7324 1452.9855 1457.4162 1463.0873 1466.8631 1469.1006 1474.9977 1477.0078 1486.1268 1492.4050 1675.0050 1703.8702 2942.6630 2962.2873 2965.9245 2968.1232 2975.5533 2982.4055 2984.8344 2997.5972 2998.7611 3005.5362 3027.1137 3030.5583 3039.5249 3045.6020 3055.5407 3067.3699 3072.8854 3078.9299 3091.2610 3093.0212
redmass: 4.3482 4.1413 1.2573 3.2830 1.8324 2.6655 1.8815 1.6577 2.5346 2.5804 2.4208 3.8829 2.1260 2.1443 2.7853 3.0187 3.5405 2.6212 4.0625 3.1840 3.3506 2.8416 2.4797 3.6422 4.4154 3.3770 3.9480 4.1515 2.7176 2.1401 2.3404 1.6378 2.1600 2.4428 3.2186 2.1141 2.0122 2.1084 1.5121 1.7438 1.9485 2.2699 1.6902 2.2079 1.7558 2.4861 1.9094 1.5483 1.7531 2.5089 1.8928 2.5829 1.4626 1.7939 1.8815 1.4320 1.2758 1.3733 1.3331 1.5893 1.8201 1.6192 1.5532 1.4041 1.4917 1.6198 1.3979 1.5120 1.2003 1.2108 1.0870 1.0864 1.0747 1.0772 1.0693 1.0715 1.0805 1.0727 1.0657 1.0670 7.4136 12.6288 1.0629 1.0417 1.0661 1.0602 1.0382 1.0718 1.0594 1.0801 1.0853 1.0702 1.0988 1.0959 1.0998 1.1028 1.0902 1.0982 1.0943 1.0952 1.0947 1.0973
irintensity: 1.4555 0.4721 0.1400 3.2534 1.4046 2.7905 1.1187 1.5186 0.2872 0.5079 0.8672 1.2462 0.2847 2.5157 3.2981 0.7533 1.2094 0.8445 3.8911 1.4808 0.9996 0.3685 1.3399 0.4654 16.8818 1.9684 2.2378 18.7650 7.1361 4.8044 8.0849 1.4352 7.3612 9.1916 61.1201 2.2257 31.3403 12.7406 9.7212 4.3496 2.2628 7.4218 3.0777 26.0625 12.0312 87.1028 34.8707 4.0947 5.1107 6.9270 5.1308 1.9514 9.0141 7.0650 4.1033 11.5991 5.2751 2.0346 5.7591 1.7126 2.9189 0.7966 0.8708 1.7272 1.3548 1.9065 2.8373 7.8711 20.7098 9.5628 9.2942 13.4869 4.7891 2.5188 3.5902 18.1665 12.3059 4.6297 21.5965 7.9284 2.9906 404.4147 36.8785 47.7393 14.9156 29.0448 30.3944 16.5319 30.6368 29.4966 47.3088 25.7166 36.8271 21.0270 20.5382 58.8955 28.9017 36.3609 36.1329 39.2022 36.0970 12.5694
temp: 298.150 k
press: 1.00000 atm
elementType: 8 8 6 6 6 6 6 6 6 6 6 6 6 6 6 6 1 1 1 1 1 1 1 1 1 1 1 1 1 1 1 1 1 1 1 1
symmnumber: 1
zpe: 816192.0 jmol-1
zpe.correction: 0.310871 hartree
zpe.thermalcorrener: 0.325666 hartree
zpe.thermalcorrenthalpy: 0.326610 hartree
zpe.thermalcorrgfe: 0.270002 hartree
zpe.sumelectzpe: -694.710041 hartree
zpe.sumelectthermal: -694.695247 hartree
zpe.sumelectthermalent: -694.694303 hartree
zpe.sumelectthermalfe: -694.750910 hartree
dipole: 5.5846 0.8122 2.4761
dipole: 6.1626
quadrupole: -120.9138 -93.0887 -96.6629
quadrupole: -1.6488 -12.1916 0.6325
quadrupole: -17.3587 10.4665 6.8922 -1.6488 -12.1916 0.6325
hfenergy: -695.0209124 hartree
pointgroup: C01 [X(C14H20O2)]
dipole: -2.2030553 -0.3456118 0.951649 debye
polarizability: 171.7583808|3.8084173|147.2873019|2.7295107|5.3498001|124.7537115 unknown
InChI: InChI=1S/C14H20O2/c1-9-4-3-5-14(2)8-12-10(6-11(9)14)7-13(15)16-12/h10,12H,3-8H2,1-2H3
charge 0 multiplicity 1
36 atoms
O  2.909509 0.998847 -0.098773
O  4.179258 -0.52915 -1.308553
C  -0.964645 1.091087 0.148863
C  1.454255 -0.51186 1.090256
C  0.485687 1.403712 -0.345223
C  1.590157 0.965292 0.629629
C  -1.052431 -0.423395 0.448758
C  0.00004 -0.92056 1.43673
C  -1.941173 1.508863 -0.989324
C  2.118778 -1.272108 -0.080176
C  -2.01396 -1.235633 -0.094043
C  -3.317939 0.835075 -0.850053
C  -1.279163 1.931009 1.4255
C  -3.146711 -0.691268 -0.962561
C  3.192072 -0.300976 -0.592219
C  -2.099625 -2.741174 0.109939
H  2.085636 -0.649946 1.989793
H  0.584831 2.487322 -0.547957
H  0.646235 0.884422 -1.310404
H  1.702572 1.667449 1.471032
H  -0.23472 -0.507441 2.440045
H  -0.040631 -2.016618 1.55471
H  -1.50755 1.21742 -1.967856
H  -2.036795 2.61233 -0.997251
H  1.398142 -1.477302 -0.895441
H  2.584858 -2.228417 0.204577
H  -4.010359 1.202795 -1.630874
H  -3.771599 1.089399 0.127639
H  -2.329396 1.791042 1.738058
H  -0.641038 1.657791 2.284528
H  -1.121632 3.007189 1.221566
H  -2.958832 -0.971871 -2.022084
H  -4.087855 -1.207652 -0.682193
H  -2.357567 -3.234918 -0.847366
H  -2.907887 -3.000663 0.823309
H  -1.167621 -3.198796 0.478718
