program: Gaussian 09
title: 000278209
version: EM64L-G09RevD.01
frameworkgroup: C1[X(C14H24O2)]
method: RPBEPBE
basis: SDD
operation: Freq
keyword: #pfreq=noraman
keyword: PBEPBE/SDD
title: #p freq=noraman PBEPBE/SDD
converged: YES YES NO NO
title: Mulliken charges:
elementType: O O C C C C C C C C C C C C C C H H H H H H H H H H H H H H H H H H H H H H H H
charge: -0.444603 -0.434556 0.272692 -0.521399 0.277887 -0.037245 -0.161300 -0.456656 -0.675912 -0.455645 0.162398 -0.781843 -0.494940 -0.462295 -0.817889 -0.342567 0.222971 0.236660 0.183735 0.209161 0.201419 0.203819 0.219715 0.217071 0.205214 0.206168 0.226803 0.209921 0.217164 0.215374 0.212456 0.219039 0.239005 0.227430 0.227081 0.221435 0.329400 0.179756 0.212785 0.330292
chargesum: 0.00000
title: Mulliken charges with hydrogens summed into heavy atoms:
elementType: O O C C C C C C C C C C C C C C
charge: -0.115203 -0.104264 0.272692 -0.061768 0.277887 0.146490 0.047861 -0.051417 -0.239126 -0.044263 0.162398 -0.127955 -0.067110 -0.004251 -0.141943 0.049973
polarizability: 1.64129130e+02 9.13373862e+00 1.65586431e+02 -4.97950297e+00 -1.62882861e+00 1.28262751e+02
1716.lowfreq: -22.9705 -17.5462 -0.0008 0.0003 0.0003 0.9995 37.5108 46.6015 75.7712
frequency: 37.3910 46.3150 75.7222 96.5173 100.7690 130.7615 142.9296 171.5436 207.8380 217.2519 243.3917 263.0174 270.9429 302.7166 306.3493 323.3314 341.9149 362.7551 369.7718 395.0281 395.7257 416.2388 433.6011 457.5135 511.7441 542.9826 573.1438 599.4785 627.1208 685.2790 785.2497 804.3752 820.9972 852.2319 864.6479 875.2115 885.3835 927.2800 936.4396 946.1966 968.1885 980.4421 989.8848 994.2182 1025.8533 1031.6918 1044.6380 1048.6543 1065.8071 1077.7786 1091.7184 1119.4356 1129.4988 1144.9650 1154.9006 1162.7575 1181.1068 1194.9329 1199.7215 1212.0171 1242.4002 1250.4558 1261.8289 1267.7746 1290.4432 1294.9273 1309.2581 1326.1567 1328.9458 1337.4783 1339.3268 1348.4516 1353.0689 1369.2761 1378.6781 1379.1137 1394.5510 1404.0549 1450.1799 1456.2692 1459.8465 1462.7432 1466.8460 1469.7256 1474.4174 1476.6334 1485.7101 1487.4629 1490.8310 1674.5217 2922.9830 2935.5937 2940.0994 2944.1000 2958.4471 2961.7532 2966.2592 2969.4200 2975.0708 2979.2038 2989.8175 2994.9142 3024.8211 3029.2635 3035.0016 3041.1147 3048.4580 3061.1064 3067.1484 3069.8926 3079.4056 3093.0448 3547.2351 3555.1885
redmass: 4.2014 4.0175 1.8577 1.7701 1.8846 2.1350 2.1448 4.1598 1.9801 1.7593 2.4309 2.4393 2.1357 1.1814 1.3010 2.1651 3.0276 2.2106 2.3478 2.8418 2.8324 3.4620 2.8933 2.6550 3.2438 3.7215 2.2914 3.1336 3.1397 2.8991 1.4002 2.7770 1.7213 1.7122 2.2005 2.3936 2.0191 2.1224 2.0887 2.4690 2.2724 1.5617 1.7435 3.1810 1.6444 2.1343 1.7352 2.5800 1.9862 1.5973 1.7917 1.8586 1.7121 1.5875 1.4811 1.6849 2.4003 1.5546 1.6606 1.6746 1.4450 1.3684 1.5096 1.3161 1.2160 1.4889 1.3327 1.5586 1.3421 1.4385 1.5225 1.4683 1.6881 1.3892 1.2499 1.2198 1.2163 1.5551 1.0839 1.0853 1.0790 1.0637 1.0753 1.0680 1.0764 1.0799 1.0899 1.0706 1.0675 7.3350 1.0806 1.0700 1.0625 1.0819 1.0698 1.0439 1.0600 1.0619 1.0390 1.0733 1.0593 1.0832 1.0987 1.0959 1.0950 1.1030 1.1016 1.0972 1.0971 1.0907 1.0987 1.0934 1.0659 1.0661
irintensity: 0.9310 1.4928 4.3451 1.2144 1.6034 0.0827 0.5012 5.6052 3.8016 0.7617 1.6607 14.7855 1.5539 119.4648 138.3570 30.9044 8.3065 7.6001 2.5076 2.1619 11.2879 3.4102 9.1375 1.6111 0.8974 4.2217 1.4897 1.9012 13.0225 2.0656 9.3918 5.6313 0.7777 2.5972 5.3583 0.3820 2.5936 26.7223 18.6378 54.1179 24.2602 11.2690 3.3810 60.4708 13.4175 12.2297 4.5628 15.5782 9.9208 7.9924 13.7458 15.4145 12.8026 10.6820 1.5109 0.4608 2.3170 8.1276 5.1584 9.0687 25.5962 10.8163 2.8143 2.5135 6.1448 9.8168 0.3435 10.1208 4.0508 1.1072 0.9669 1.2136 5.6194 1.6093 47.3514 3.4252 8.3368 3.8272 3.5653 10.0548 6.4507 17.6270 1.4270 2.1818 4.7625 11.7097 5.2432 24.2915 6.9351 1.2307 31.1576 70.6613 38.8813 32.2569 82.6946 49.4637 31.5317 13.0253 39.9666 21.1843 32.8603 59.6944 43.4836 20.7634 17.9537 47.2132 62.8978 39.1470 61.9707 15.6142 38.2252 40.3892 2.3132 4.9745
temp: 298.150 k
press: 1.00000 atm
elementType: 8 8 6 6 6 6 6 6 6 6 6 6 6 6 6 6 1 1 1 1 1 1 1 1 1 1 1 1 1 1 1 1 1 1 1 1 1 1 1 1
symmnumber: 1
zpe: 927620.4 jmol-1
zpe.correction: 0.353312 hartree
zpe.thermalcorrener: 0.370699 hartree
zpe.thermalcorrenthalpy: 0.371643 hartree
zpe.thermalcorrgfe: 0.309082 hartree
zpe.sumelectzpe: -697.028372 hartree
zpe.sumelectthermal: -697.010985 hartree
zpe.sumelectthermalent: -697.010041 hartree
zpe.sumelectthermalfe: -697.072603 hartree
dipole: 0.6862 -1.1719 1.6207
dipole: 2.1145
quadrupole: -96.4279 -107.1715 -97.6377
quadrupole: 9.7903 -4.0093 -2.7916
quadrupole: 3.9845 -6.7592 2.7747 9.7903 -4.0093 -2.7916
hfenergy: -697.3816842 hartree
pointgroup: C01 [X(C14H24O2)]
dipole: 0.2536604 -0.4594469 0.6454598 debye
polarizability: 164.6783833|9.1027854|165.0509028|-4.9246782|-1.9376173|128.2490257 unknown
InChI: InChI=1S/C14H24O2/c1-10-4-3-6-14(2)9-13(16)11(5-7-15)8-12(10)14/h11,13,15-16H,3-9H2,1-2H3
charge 0 multiplicity 1
40 atoms
O  -2.081149 -2.766561 -0.444679
O  -3.814865 2.085639 -1.046176
C  1.297317 -0.977758 -0.022309
C  0.123361 -1.8134 -0.635749
C  0.743525 0.351653 0.544813
C  -1.639516 -0.587589 0.742826
C  -1.083362 -1.965263 0.296962
C  2.329766 -0.721918 -1.157612
C  -0.479318 0.185761 1.444774
C  3.332875 0.388448 -0.794934
C  1.311516 1.568156 0.268439
C  1.983455 -1.800675 1.113677
C  2.574713 1.712205 -0.580428
C  -2.264499 0.216519 -0.425356
C  0.784135 2.909142 0.758181
C  -3.261485 1.28431 0.05874
H  0.493035 -2.820221 -0.9100
H  -0.223717 -1.333223 -1.570504
H  -2.432865 -0.774603 1.503186
H  -0.784532 -2.521263 1.213578
H  1.787726 -0.418749 -2.076866
H  2.853834 -1.669652 -1.39141
H  -0.193343 -0.380151 2.356984
H  -0.850295 1.158805 1.805316
H  4.088233 0.505911 -1.595419
H  3.884727 0.119216 0.126501
H  2.865689 -1.266686 1.508598
H  1.305752 -1.990636 1.964691
H  2.316945 -2.782299 0.725658
H  2.291688 2.147061 -1.564196
H  3.23903 2.46435 -0.106293
H  -2.78725 -0.490681 -1.10284
H  -1.471478 0.71375 -1.014593
H  0.820324 3.651166 -0.06338
H  1.419771 3.31122 1.573232
H  -0.253623 2.877706 1.12639
H  -2.846929 -2.951132 0.157501
H  -4.080227 0.804375 0.640961
H  -2.771741 2.031446 0.706936
H  -4.20142 1.46802 -1.717899
