program: Gaussian 09
title: 000278216
version: EM64L-G09RevD.01
frameworkgroup: C1[X(C14H24OS2)]
method: RPBEPBE
basis: SDD
operation: Freq
keyword: #p
keyword: freq=noraman
keyword: PBEPBE/SDD
title: #p freq=noraman PBEPBE/SDD
converged: YES YES NO NO
title: Mulliken charges:
elementType: S S O C C C C C C C C C C C C C C H H H H H H H H H H H H H H H H H H H H H H H H
charge: 0.239318 0.214282 -0.437859 0.334775 0.374628 -0.030192 -0.504364 -0.665578 -0.483336 -0.468718 -0.401808 -0.419907 -0.415011 -0.811917 -0.809667 -0.615409 -0.618965 0.216007 0.229855 0.206541 0.223261 0.231217 0.194918 0.191431 0.232213 0.247089 0.199737 0.198781 0.197276 0.200811 0.212458 0.216046 0.251399 0.211971 0.231555 0.213383 0.333878 0.279187 0.263022 0.277202 0.260486
chargesum: 0.00000
title: Mulliken charges with hydrogens summed into heavy atoms:
elementType: S S O C C C C C C C C C C C C C C
charge: 0.239318 0.214282 -0.103982 0.334775 0.374628 0.185815 -0.067968 -0.665578 -0.028858 -0.082369 0.077495 -0.021388 -0.016923 -0.132014 -0.152758 -0.073200 -0.081277
polarizability: 2.17679089e+02 5.32539365e+00 1.69104550e+02 -4.71802466e+00 2.62975137e+00 1.52031241e+02
1716.lowfreq: -22.7557 -10.9979 -6.2342 0.0016 0.0019 0.0026 41.9416 69.9535 109.1990
frequency: 40.7880 69.6359 109.1632 144.1710 168.1200 179.2075 195.3818 203.8557 210.8310 222.6931 243.9361 258.5311 290.6983 303.1780 309.2722 332.1007 361.8498 369.8068 377.5119 388.5423 412.0369 437.1159 440.4546 465.3722 478.4871 502.9850 507.2600 544.7251 572.3867 599.1693 626.9294 644.9463 655.8064 743.0003 766.2489 794.1302 834.5691 851.8563 853.4392 871.8199 905.1248 915.7302 938.3268 945.0359 950.9426 959.0236 993.5116 1002.3504 1003.7130 1011.0693 1019.5625 1037.3348 1061.1466 1086.7045 1101.5003 1108.9479 1112.8555 1129.9713 1137.7559 1147.3386 1165.0351 1178.3716 1200.6022 1202.5533 1222.7993 1251.8136 1255.6770 1269.4984 1276.2798 1287.4576 1297.3775 1315.5174 1327.3550 1334.6440 1336.2935 1339.6519 1342.8788 1350.1713 1360.5612 1385.9533 1397.3803 1435.2106 1443.2719 1457.0386 1461.8282 1463.4996 1465.9805 1469.1291 1477.7846 1483.5179 1485.4796 1489.5946 1503.0476 2902.5582 2959.0485 2971.1454 2973.8540 2975.2336 2978.1950 2989.6157 3006.0270 3007.5319 3010.5106 3022.9955 3025.0581 3032.8245 3033.3227 3036.9005 3060.0352 3066.6728 3069.4819 3075.9147 3079.2265 3096.8078 3099.4605 3118.7895 3457.2384
redmass: 3.7286 4.0121 4.7565 2.2736 2.7854 4.1104 3.2535 2.1995 2.8069 1.6388 2.1430 1.9358 2.6464 3.0760 3.0041 1.9797 2.7249 3.2942 2.2186 4.3660 2.8305 2.7767 3.3479 1.2424 2.3136 2.6500 3.2875 3.0074 2.1598 4.5001 6.3489 3.8613 3.3062 3.6167 2.4769 1.6344 2.3168 2.2053 1.5572 1.6473 1.8463 2.0317 1.8147 1.8568 1.6065 1.8310 2.2888 1.7444 2.3360 2.2073 1.8378 2.8722 1.6575 1.7169 1.1419 1.7088 2.7188 2.2487 2.1762 1.4389 1.9496 1.8866 1.4782 2.1817 1.4968 1.2718 1.5537 1.4633 1.2905 1.1995 1.5856 1.3008 1.2933 1.4021 1.3760 1.3882 1.4841 1.4649 1.3592 1.1908 1.1985 1.0837 1.0968 1.0744 1.0767 1.0815 1.0734 1.0735 1.0641 1.0602 1.0723 1.0762 1.0595 1.0812 1.0590 1.0605 1.0408 1.0624 1.0586 1.0372 1.0664 1.0657 1.0976 1.0558 1.0943 1.0973 1.0606 1.1000 1.0983 1.1007 1.1007 1.0982 1.0979 1.0988 1.1072 1.1073 1.0645
irintensity: 4.7198 2.4386 1.0699 1.8140 3.1776 0.3108 0.6998 0.5656 3.0530 0.8185 2.1413 1.4474 0.7234 4.0393 2.8815 0.1611 1.6017 1.5544 0.9553 1.4829 1.0625 0.6576 7.2418 108.8819 21.2480 4.0005 3.9507 3.0380 15.5566 9.1946 5.6083 1.3405 9.4334 7.8407 8.9036 1.9391 3.6797 3.6035 5.7984 2.7970 12.2536 12.0367 12.5345 1.3743 15.2645 2.6384 23.8622 7.7901 5.5372 22.0996 2.7240 4.2986 0.9224 6.4820 5.9890 2.2943 1.6604 6.5513 10.5194 0.9581 4.0723 9.2349 2.0201 1.9090 2.4063 4.0806 2.4637 22.1605 3.1357 12.7296 2.9750 1.8046 1.4527 5.1572 2.8883 5.3464 2.2864 1.4132 15.7695 14.9505 35.0750 11.2467 6.9922 5.8708 14.4397 19.8254 6.2613 3.5425 14.4828 18.9951 4.9564 9.1876 2.1269 25.0927 29.0379 15.9264 29.2764 47.4464 47.3215 32.4879 14.1976 7.9648 36.6987 14.0231 68.5212 32.8761 42.8057 74.6919 36.1270 11.2247 52.6091 63.7716 8.3322 21.4181 0.4616 16.0423 9.5146
temp: 298.150 k
press: 1.00000 atm
elementType: 16 16 8 6 6 6 6 6 6 6 6 6 6 6 6 6 6 1 1 1 1 1 1 1 1 1 1 1 1 1 1 1 1 1 1 1 1 1 1 1 1
symmnumber: 1
zpe: 931482.2 jmol-1
zpe.correction: 0.354783 hartree
zpe.thermalcorrener: 0.372235 hartree
zpe.thermalcorrenthalpy: 0.373179 hartree
zpe.thermalcorrgfe: 0.311765 hartree
zpe.sumelectzpe: -1417.872749 hartree
zpe.sumelectthermal: -1417.855296 hartree
zpe.sumelectthermalent: -1417.854352 hartree
zpe.sumelectthermalfe: -1417.915767 hartree
dipole: -1.0945 0.3677 -0.5502
dipole: 1.2790
quadrupole: -107.7270 -121.9681 -122.8878
quadrupole: 6.3250 -2.0970 0.1937
quadrupole: 9.8006 -4.4405 -5.3601 6.3250 -2.0970 0.1937
hfenergy: -1418.2275317 hartree
pointgroup: C01 [X(C14H24O1S2)]
dipole: 0.4306414 -0.2268145 -0.1276722 debye
polarizability: 217.6649507|6.9598243|163.4329722|1.6245821|-8.4835317|157.7169575 unknown
InChI: InChI=1S/C14H24OS2/c1-12-5-3-4-6-13(12,2)11(15)14(8-7-12)16-9-10-17-14/h11,15H,3-10H2,1-2H3
charge 0 multiplicity 1
41 atoms
S  1.914873 0.55077 -1.587507
S  3.108431 -1.007719 0.792324
O  1.114224 1.347764 1.474825
C  -0.971969 0.331368 0.650879
C  -1.592673 -1.007904 0.048113
C  0.541807 0.090563 0.986178
C  -0.685203 -1.540134 -1.107134
C  1.434365 -0.563269 -0.110903
C  -1.141797 1.526268 -0.343931
C  -3.0303 -0.740492 -0.509407
C  0.765689 -1.837527 -0.659068
C  -2.598582 1.740809 -0.810807
C  -3.147129 0.459533 -1.474774
C  -1.651685 0.714428 1.999269
C  -1.741668 -2.129089 1.119373
C  3.50285 1.223282 -0.834837
C  4.281345 0.03209 -0.269246
H  0.558975 -0.654161 1.817724
H  -0.661914 -0.816237 -1.944006
H  -1.133121 -2.470164 -1.510484
H  -0.509512 1.373703 -1.236094
H  -0.748986 2.43511 0.147131
H  -3.71629 -0.569052 0.345301
H  -3.384253 -1.666932 -1.007367
H  0.766206 -2.613337 0.129464
H  1.368199 -2.231524 -1.495873
H  -2.631623 2.587552 -1.523947
H  -3.246794 2.023263 0.042899
H  -4.206521 0.594127 -1.76917
H  -2.584147 0.259893 -2.408963
H  -2.748128 0.793681 1.898039
H  -1.439492 -0.028643 2.789147
H  -1.262332 1.686132 2.346479
H  -0.80659 -2.347779 1.665303
H  -2.50724 -1.862421 1.868697
H  -2.068831 -3.067492 0.631325
H  2.013326 1.112623 1.834579
H  3.243698 1.965396 -0.063966
H  4.053437 1.711365 -1.657832
H  4.676439 -0.604297 -1.076034
H  5.101112 0.354652 0.3966
