program: Gaussian 09
title: 000278194
version: EM64L-G09RevD.01
frameworkgroup: C1[X(C7H11N3O4)]
method: RPBEPBE
basis: SDD
operation: Freq
keyword: #p
keyword: freq=noraman
keyword: PBEPBE/SDD
title: #p freq=noraman PBEPBE/SDD
converged: YES YES NO NO
title: Mulliken charges:
elementType: O O O O N N N C C C C C C C H H H H H H H H H H H
charge: -0.244879 -0.445939 -0.446341 -0.434634 -0.055672 -0.101020 -0.107577 -0.171628 -0.193830 -0.094114 -0.098771 -0.376761 -0.143028 -0.249017 0.275359 0.274680 0.262857 0.270997 0.216435 0.251759 0.357191 0.355567 0.282100 0.342333 0.273935
chargesum: 0.00000
title: Mulliken charges with hydrogens summed into heavy atoms:
elementType: O O O O N N N C C C C C C C
charge: -0.244879 -0.088748 -0.090774 -0.092301 -0.055672 -0.101020 -0.107577 0.103731 0.080849 0.168742 0.172225 0.091432 0.139072 0.024918
polarizability: 1.33397874e+02 -1.13120227e+00 9.91148414e+01 5.05999750e+00 4.38532713e+00 7.66493860e+01
1716.lowfreq: -12.1803 -0.0002 0.0004 0.0005 8.0342 15.2678 46.1262 66.2817 97.2296
frequency: 46.0200 66.2692 97.1966 100.9084 154.1069 188.4013 207.0714 230.6973 274.0771 305.0789 309.4673 312.7368 353.0800 390.4713 427.5223 469.6453 529.9030 652.5858 661.8826 701.1925 752.9915 766.2475 784.7517 824.5284 832.1311 860.6426 877.9058 917.9830 927.7047 955.7079 973.2806 979.3872 999.3570 1017.7177 1041.7668 1056.6778 1075.5871 1115.7641 1153.9965 1166.9201 1176.8166 1182.8799 1210.5401 1236.9073 1247.8936 1276.2174 1285.6611 1290.8819 1308.0484 1324.4254 1332.6536 1351.9681 1357.6349 1368.3772 1397.1389 1431.3459 1471.9260 1476.2758 2992.7729 3024.9671 3032.4995 3056.0273 3065.6799 3105.8380 3132.2069 3249.3652 3260.7392 3563.8914 3575.5213
redmass: 6.7005 5.9474 5.0511 4.8481 4.1109 5.8186 4.6796 4.6514 3.9049 4.1493 1.8263 1.2953 2.3733 3.7716 4.8247 6.6664 4.7300 3.7758 3.4793 6.1717 2.4645 1.4560 5.0263 1.4890 2.6369 1.4132 3.6273 5.7361 3.5162 3.1936 3.7555 5.8981 4.6041 3.6401 5.8938 1.8014 1.5921 2.1898 1.5302 1.6577 2.2209 1.5986 1.6211 1.3816 2.4678 1.1846 1.4220 1.2052 3.3922 1.3475 1.8159 1.6658 1.8328 1.2202 1.8216 2.8914 1.1448 1.0781 1.0668 1.0861 1.0874 1.0856 1.0876 1.0991 1.0705 1.0985 1.1015 1.0664 1.0664
irintensity: 2.3915 0.2354 2.2913 3.4170 8.4725 5.9887 10.7540 2.1519 6.0893 34.1713 10.6117 252.9043 49.4800 2.4110 14.5106 2.1265 24.7718 26.6200 6.6119 14.4242 22.8906 109.7503 61.8897 37.7429 17.4215 11.1072 20.4697 16.9694 65.4719 34.3511 89.0278 69.9670 106.6955 40.3489 71.3346 13.1956 16.1707 34.3950 11.2368 39.8389 1.8904 4.0341 43.8854 9.3776 40.8189 5.8571 15.0854 8.7075 2.4513 12.8628 10.3494 26.2785 2.2386 6.3903 40.8401 29.2621 53.7008 17.9247 48.7754 29.5679 15.5121 64.4942 11.1277 12.6689 590.4986 0.4633 1.5489 8.9291 15.1314
temp: 298.150 k
press: 1.00000 atm
elementType: 8 8 8 8 7 7 7 6 6 6 6 6 6 6 1 1 1 1 1 1 1 1 1 1 1
symmnumber: 1
zpe: 504503.9 jmol-1
zpe.correction: 0.192155 hartree
zpe.thermalcorrener: 0.205022 hartree
zpe.thermalcorrenthalpy: 0.205966 hartree
zpe.thermalcorrgfe: 0.152559 hartree
zpe.sumelectzpe: -737.353967 hartree
zpe.sumelectthermal: -737.341101 hartree
zpe.sumelectthermalent: -737.340157 hartree
zpe.sumelectthermalfe: -737.393564 hartree
dipole: 0.3560 -1.1537 0.2218
dipole: 1.2276
quadrupole: -93.4519 -81.7996 -78.9617
quadrupole: 1.4261 -4.3806 -5.3874
quadrupole: -8.7142 2.9381 5.7760 1.4261 -4.3806 -5.3874
hfenergy: -737.5461226 hartree
pointgroup: C01 [X(C7H11N3O4)]
dipole: 0.0743883 0.0420964 0.4753642 debye
dipolederiv: -1.1775428 0.0329427 0.0217854 0.226563 -0.4331244 0.00047 0.2631793 -0.0729618 -0.3746646 -0.7817314 0.048472 -0.1111892 0.0569418 -0.5754001 -0.0022587 -0.1459173 0.0276476 -0.6902599 -0.5814486 0.122818 -0.1161412 0.0695972 -0.346467 -0.2626203 -0.1684389 -0.2662814 -0.732204 -0.9744423 0.0692695 0.0691143 0.0319172 -0.3766079 0.2112824 0.0700809 0.2304801 -0.3061259 -0.7741888 -0.0099066 -0.2283087 -0.0764367 -0.1368442 -0.0767134 -0.506401 -0.069773 -0.2625351 -0.5709444 -0.1824161 0.0834739 -0.2271334 -0.2013474 0.0258676 0.3117711 0.1002145 -0.1148746 -0.5329895 -0.0551173 -0.0776495 -0.0364254 -0.2756938 0.0656046 -0.2006017 0.0590047 -0.4774378 0.2471363 -0.0354122 0.2104126 -0.1672133 0.2376721 -0.0487904 0.179294 -0.1197025 0.3797703 0.3098201 0.0069135 0.1779067 0.1106845 0.1999143 0.1508978 0.1823098 0.2131281 0.4200243 0.5856359 0.0179174 -0.1019237 0.2416626 0.0822006 0.0981094 -0.2813491 0.0750116 0.2081716 1.3314573 -0.1168105 0.1393557 -0.4542275 0.4201485 0.0527639 0.2539235 0.1198318 0.4743637 0.5896082 -0.0027107 -0.13377 0.0103864 0.2871074 -0.068848 -0.1109211 -0.0975482 0.2569164 0.5931677 0.1240625 0.1747479 0.2246409 0.0298726 -0.0137154 0.0976965 -0.0511547 0.1564218 0.1318122 0.0992248 -0.0167747 0.0424747 0.0259722 -0.1563575 0.0689413 -0.1417647 0.3462683 -0.0161503 -0.0922059 -0.0482727 -0.0955063 0.0326526 -0.0197127 -0.0373655 -0.0107703 0.0425523 -0.0400527 0.0845262 -0.0491235 0.1115513 -0.0437571 0.0099081 -0.0536606 0.0058018 -0.0050926 -0.0015665 0.0135953 0.0136449 0.0163318 0.0296466 -0.0674117 0.0615869 -0.0672956 -0.0901608 -0.0427967 0.0084944 0.0644186 0.0126592 0.0831048 0.0357935 0.062116 -0.0127707 -0.0314706 -0.0252761 0.0240212 0.0135999 0.0306645 -0.1924042 0.0778467 0.0102894 0.0284034 0.0674918 0.0703623 -0.0355201 0.0270463 -0.0348324 0.0723792 -0.0773792 0.0270994 -0.0363233 -0.0429963 0.7636703 0.1358344 -0.0293447 0.1338981 0.3344516 0.0177648 -0.0974065 -0.0059854 0.2841452 0.2551287 -0.1486765 -0.0100841 -0.1311418 0.1932007 0.1048754 0.0292053 0.1409453 0.3044485 0.1394814 -0.0162362 -0.0243284 -0.0179013 0.170649 0.0495599 -0.027979 0.0485488 0.0499302 0.3942781 -0.0794199 -0.0179309 -0.0601412 0.2245515 -0.1486119 0.0376482 -0.1422992 0.0964388 0.1075714 -0.0136601 -0.0306651 -0.0190137 0.1581224 0.0416751 -0.0251007 0.045613 0.0408791 unknown
polarizability: 131.6282339|8.3271474|78.5008206|6.6421314|-5.6244002|99.0330467 unknown
InChI: InChI=1S/C7H11N3O4/c11-1-4-5(12)6(13)7(14-4)10-3-8-2-9-10/h2-7,11-13H,1H2
charge 0 multiplicity 1
25 atoms
O  0.600797 -1.226709 0.35389
O  0.865239 1.258524 -1.775335
O  1.116817 1.353279 1.978533
O  4.228152 -0.314235 -0.137078
N  -1.571181 -0.227461 0.088187
N  -1.648896 0.240918 -1.229343
N  -3.655459 -0.708115 -0.59121
C  1.441783 0.908311 -0.489137
C  0.446293 1.162043 0.685355
C  1.7707 -0.59925 -0.352851
C  -0.298877 -0.185522 0.838065
C  3.030847 -0.901455 0.482445
C  -2.776763 -0.796972 0.436232
C  -2.92139 -0.071276 -1.585382
H  2.359323 1.513081 -0.393123
H  -0.231931 2.004062 0.449957
H  1.829642 -1.059887 -1.356467
H  -0.537516 -0.384504 1.896783
H  3.133078 -1.99645 0.618939
H  2.949783 -0.423371 1.470678
H  -0.085213 0.907232 -1.808092
H  1.709234 2.144697 1.921835
H  -2.973066 -1.248984 1.404627
H  4.40928 -0.766565 -0.999625
H  -3.319177 0.16621 -2.567683
