program: Gaussian 09
title: 000278211
version: EM64L-G09RevD.01
frameworkgroup: C1[X(C15H24O3)]
method: RPBEPBE
basis: SDD
operation: Freq
keyword: #pfreq=noraman
keyword: PBEPBE/SDD
title: #p freq=noraman PBEPBE/SDD
converged: NO YES NO NO
title: Mulliken charges:
elementType: O O O C C C C C C C C C C C C C C C H H H H H H H H H H H H H H H H H H H H H H H H
charge: -0.437602 -0.265466 -0.248202 0.285923 -0.547173 0.294743 -0.032828 -0.158123 -0.457426 -0.694330 -0.455541 0.154574 -0.785210 -0.497354 -0.562526 -0.829589 0.229149 -0.505956 0.227375 0.196343 0.243809 0.230493 0.196946 0.203796 0.210825 0.248400 0.205470 0.205841 0.227309 0.215903 0.216415 0.213388 0.213483 0.241607 0.287929 0.225909 0.241416 0.222781 0.324239 0.239300 0.233504 0.240457
chargesum: 0.00000
title: Mulliken charges with hydrogens summed into heavy atoms:
elementType: O O O C C C C C C C C C C C C C C C
charge: -0.113363 -0.265466 -0.248202 0.285923 -0.123455 0.294743 0.210982 0.072370 -0.056684 -0.235106 -0.044230 0.154574 -0.125584 -0.070483 -0.032990 -0.139483 0.229149 0.207305
polarizability: 1.94691757e+02 4.25593558e+00 1.75033954e+02 -6.92010731e+00 -6.63462474e+00 1.32744383e+02
1716.lowfreq: -5.6391 0.0007 0.0008 0.0010 9.8464 13.9629 23.7999 39.6491 46.2544
frequency: 23.7010 39.6331 46.1490 76.4790 96.6374 104.9048 113.5517 131.3296 148.0330 159.4282 202.4943 206.5683 234.8120 252.7868 271.5264 292.2284 304.6031 319.8902 328.0080 346.5385 370.7322 382.3819 393.2993 408.2896 434.9182 473.6207 486.0242 526.1455 545.4534 559.8909 585.5970 634.8715 665.3858 683.0261 792.1876 807.7871 835.4266 846.9999 865.3560 876.0678 885.0460 916.5655 933.9612 954.3731 964.0763 975.1817 985.9712 1008.2235 1024.1011 1046.2915 1056.9460 1075.8653 1098.0020 1111.6187 1113.9693 1122.6944 1129.0998 1130.2263 1147.9028 1152.6649 1164.1243 1173.5053 1186.7191 1194.8068 1205.9147 1218.3376 1236.5763 1264.4674 1274.1980 1299.2696 1313.1581 1319.0359 1333.5629 1336.8098 1340.0563 1349.5626 1352.5051 1370.4389 1373.0927 1384.8281 1392.8631 1421.5892 1438.3104 1449.0558 1452.8618 1454.3477 1457.8459 1464.1117 1464.3393 1468.0044 1473.9724 1476.5762 1488.4569 1493.1964 1638.3198 1677.2664 2940.1475 2945.0801 2946.5085 2960.2203 2964.1223 2974.3750 2977.3153 2980.3641 2982.7889 2995.5739 3003.3246 3018.2750 3023.2418 3029.5551 3037.9301 3042.7341 3044.9031 3069.1251 3074.3028 3082.3735 3092.0288 3104.1884 3148.1923 3534.6502
redmass: 5.6900 3.8925 4.0124 3.3867 1.1975 1.1060 2.7510 2.6267 2.2293 3.7074 1.3595 4.9581 2.0775 2.8968 2.3207 2.4468 2.0547 2.7441 1.7822 2.7024 2.2103 2.1295 2.7040 3.1136 3.5621 2.7960 3.0442 3.0952 3.5784 2.7217 2.5285 3.3384 4.7951 3.1925 2.4498 2.5675 3.0500 1.9273 1.7527 2.1319 2.3050 2.1783 2.0209 4.9708 2.1097 1.8234 1.6542 1.5523 2.2081 1.7708 2.9523 1.6558 2.7027 1.3282 2.0607 2.2087 2.0939 2.0075 1.4433 1.7906 1.3917 2.0027 1.8917 1.7032 1.7725 1.6628 1.5641 1.4451 1.3540 1.2860 1.4857 1.7866 1.4893 1.5210 1.4821 1.5535 1.5569 1.6763 1.1959 1.1981 1.2185 1.1930 1.0878 1.0837 1.0505 1.0912 1.0770 1.0557 1.0643 1.0660 1.0714 1.0806 1.0634 1.0702 8.7652 7.4173 1.0627 1.0694 1.0638 1.0409 1.0599 1.0808 1.0386 1.0734 1.0619 1.0834 1.0297 1.0918 1.0968 1.0953 1.0940 1.1025 1.0961 1.0972 1.0896 1.0981 1.0945 1.1045 1.1046 1.0657
irintensity: 1.6926 0.2304 0.3925 0.1670 0.5540 0.3729 2.6587 1.4579 0.7641 7.0621 0.6474 1.0183 8.8181 13.5455 3.5283 5.9904 35.6605 2.5232 32.3572 32.6595 31.3132 7.7492 1.6281 2.5916 9.1778 4.0602 6.8273 2.2812 6.0869 0.2890 1.5926 1.2266 3.4908 3.3921 3.0066 3.5870 12.3444 1.7733 1.5352 8.4655 1.5231 40.3166 2.2002 21.2583 56.0059 11.3250 19.2944 5.4664 28.7242 2.5933 10.1160 6.5102 12.7858 11.0708 76.7651 55.2338 108.4795 6.4866 4.8752 27.8817 0.5716 11.0539 35.4228 15.0948 21.0010 4.1676 40.3721 7.6234 22.2713 2.9883 26.2112 2.4763 4.8220 28.2800 4.2444 13.5613 1.1121 2.2975 20.8306 28.3399 8.7477 22.6417 29.5477 3.5103 14.2320 7.5417 4.9636 10.0030 5.2965 14.9208 12.6327 4.8034 14.2736 12.3232 141.5852 1.1638 42.4668 27.0193 12.1500 52.7595 39.1871 16.0961 26.2456 23.0852 25.4713 58.2422 34.0382 10.8563 52.5930 22.3426 30.7778 58.9185 48.3270 44.6449 11.4477 36.2436 29.1757 28.0629 17.8366 6.0977
temp: 298.150 k
press: 1.00000 atm
elementType: 8 8 8 6 6 6 6 6 6 6 6 6 6 6 6 6 6 6 1 1 1 1 1 1 1 1 1 1 1 1 1 1 1 1 1 1 1 1 1 1 1 1
symmnumber: 1
zpe: 951503.4 jmol-1
zpe.correction: 0.362409 hartree
zpe.thermalcorrener: 0.381869 hartree
zpe.thermalcorrenthalpy: 0.382814 hartree
zpe.thermalcorrgfe: 0.314438 hartree
zpe.sumelectzpe: -810.241034 hartree
zpe.sumelectthermal: -810.221573 hartree
zpe.sumelectthermalent: -810.220629 hartree
zpe.sumelectthermalfe: -810.289005 hartree
dipole: 0.5105 1.2045 0.3928
dipole: 1.3659
quadrupole: -97.2233 -116.4932 -107.9653
quadrupole: -4.5666 -2.8951 3.2621
quadrupole: 10.0040 -9.2659 -0.7381 -4.5666 -2.8951 3.2621
hfenergy: -810.6034426 hartree
pointgroup: C01 [X(C15H24O3)]
dipole: -0.2097807 0.4797697 -0.1208288 debye
polarizability: 194.519279|-3.3595326|173.9327335|-8.3723204|9.1901713|134.0180816 unknown
InChI: InChI=1S/C15H24O3/c1-10-5-4-6-15(2)9-13(16)11(7-12(10)15)8-14(17)18-3/h11,13,16H,4-9H2,1-3H3
charge 0 multiplicity 1
42 atoms
O  0.827422 -3.109118 0.706851
O  4.461386 0.313047 -0.721246
O  3.062327 1.138706 0.944544
C  -2.098695 -0.727173 -0.314753
C  -1.302461 -1.859763 0.416085
C  -1.285489 0.584332 -0.214487
C  0.928938 -0.683396 0.102581
C  0.159322 -2.01516 -0.038967
C  -3.483418 -0.596156 0.383178
C  0.169321 0.44804 -0.647769
C  -4.175612 0.738993 0.053115
C  -1.828746 1.762842 0.225755
C  -2.31766 -1.125946 -1.80771
C  -3.310271 1.903167 0.571622
C  2.379461 -0.835333 -0.396657
C  -1.052753 3.058868 0.413833
C  3.282897 0.304917 0.034183
C  5.449954 1.357242 -0.357121
H  -1.826111 -2.826908 0.284381
H  -1.297692 -1.633884 1.505038
H  0.959018 -0.413859 1.179854
H  0.209113 -2.369607 -1.085079
H  -3.343328 -0.654752 1.48237
H  -4.119559 -1.456021 0.093631
H  0.212727 0.222103 -1.735839
H  0.718094 1.393229 -0.510567
H  -5.183374 0.776228 0.509253
H  -4.315951 0.836521 -1.040952
H  -2.96391 -0.389988 -2.317923
H  -1.371668 -1.180872 -2.37439
H  -2.805892 -2.117279 -1.871623
H  -3.414532 1.987343 1.675813
H  -3.679769 2.86792 0.16617
H  2.422739 -0.924858 -1.498742
H  2.801245 -1.779027 0.005243
H  -1.233391 3.757895 -0.428121
H  0.035675 2.917391 0.509194
H  -1.402022 3.57452 1.329618
H  0.729609 -2.920641 1.676384
H  5.016699 2.361418 -0.501462
H  6.29746 1.189483 -1.036256
H  5.755494 1.24544 0.69687
