program: Gaussian 09
title: 000278193
version: EM64L-G09RevD.01
frameworkgroup: C1[X(C8H11N3O7)]
method: RPBEPBE
basis: SDD
operation: Freq
keyword: #p
keyword: freq=noraman
keyword: PBEPBE/SDD
title: #p freq=noraman PBEPBE/SDD
converged: YES YES NO NO
title: Mulliken charges:
elementType: O O O O O O O N N N C C C C C C C C H H H H H H H H H H H
charge: -0.279342 -0.417518 -0.425845 -0.434575 -0.240195 -0.236142 -0.216295 -0.220086 -0.398626 -0.401305 -0.230377 -0.137202 -0.047877 -0.043618 -0.346195 0.296076 0.307541 0.160441 0.326405 0.203540 0.254361 0.289736 0.183586 0.239675 0.338535 0.358087 0.381638 0.382983 0.352594
chargesum: 0.00000
title: Mulliken charges with hydrogens summed into heavy atoms:
elementType: O O O O O O O N N N C C C C C C C C
charge: -0.279342 -0.078982 -0.067758 -0.081981 -0.240195 -0.236142 -0.216295 -0.220086 -0.016988 -0.018322 0.096028 0.066338 0.206484 0.246119 0.077065 0.296076 0.307541 0.160441
polarizability: 1.66368768e+02 5.21242291e+00 1.07191142e+02 -4.69715510e+00 1.49611432e+01 1.11139951e+02
1716.lowfreq: -12.1879 -2.7177 -0.0011 -0.0007 -0.0006 4.2786 40.6953 43.9537 51.9676
frequency: 40.6582 43.9360 51.9100 82.1919 84.6433 142.4877 158.0871 160.8135 171.0806 179.5604 211.9227 238.4561 291.9239 310.7596 321.4731 364.1003 365.4333 380.2654 396.4019 420.1561 434.5321 492.6684 507.6313 533.3235 543.2619 569.9021 611.0684 632.5596 644.2279 663.5956 667.8274 720.5462 732.1719 767.2505 798.8973 815.3771 930.5534 957.6902 982.5520 990.3473 1005.3075 1019.5379 1041.1881 1052.0088 1083.6791 1087.6092 1113.3963 1135.7109 1174.2012 1182.8281 1187.8922 1222.2629 1252.5463 1273.1134 1289.1515 1305.5305 1334.8973 1351.3558 1356.6208 1366.8541 1374.2854 1375.6555 1380.8014 1382.4507 1406.5167 1416.7917 1456.8337 1641.3982 1684.7153 1698.3117 2911.1795 2953.5916 3034.7759 3053.7522 3087.3267 3106.7553 3532.5824 3552.1633 3552.9056 3555.3267 3559.6053
redmass: 8.9625 7.9283 6.9928 6.2788 5.9781 5.6883 4.5984 4.0649 12.4242 9.1625 4.2810 5.9192 2.4218 3.9254 1.6628 1.5493 5.4307 4.0038 5.9214 2.6623 1.4931 4.1539 8.9506 6.0834 5.3536 3.8160 6.4141 10.4237 1.7945 4.0665 1.9241 5.7569 2.6589 2.7624 3.2995 4.7567 4.4842 7.5159 3.1929 3.7657 3.0315 3.4267 3.9026 2.9811 3.3170 4.3259 2.5984 3.7879 3.7117 1.5021 1.3351 1.3327 1.2220 1.2788 1.2634 1.2917 1.2572 1.4264 2.1785 1.9826 1.5889 1.7370 1.9883 1.3913 1.7213 1.7557 1.0847 7.1660 8.4698 5.9733 1.0825 1.0691 1.0856 1.0855 1.0946 1.0864 1.0660 1.0774 1.0658 1.0786 1.0662
irintensity: 0.4198 1.6105 1.4285 0.2920 1.8842 0.7923 0.9637 0.9037 7.8811 0.6587 4.2517 22.4555 23.1201 10.9209 23.5683 215.9735 58.5162 25.0424 0.8904 46.8660 166.5209 4.5743 26.4358 25.8498 22.7330 5.2290 3.2266 1.7461 0.9919 4.7697 66.1512 8.2290 0.1796 204.6045 17.7224 69.1448 82.2764 265.1603 11.8651 15.5444 43.9225 20.5627 12.8536 34.9614 95.0507 37.3411 6.5233 7.8556 12.7478 2.2086 44.7575 26.0572 9.6417 29.4708 39.2669 16.1896 40.1794 59.8559 232.2721 254.0559 15.4887 68.5487 79.8015 37.1544 11.9116 100.1946 5.9181 644.3386 166.2243 715.0921 47.7824 67.8057 11.0871 6.5666 16.0970 1.3370 9.2964 114.2430 9.9582 84.1499 12.7040
temp: 298.150 k
press: 1.00000 atm
elementType: 8 8 8 8 8 8 8 7 7 7 6 6 6 6 6 6 6 6 1 1 1 1 1 1 1 1 1 1 1
symmnumber: 1
zpe: 556058.1 jmol-1
zpe.correction: 0.211791 hartree
zpe.thermalcorrener: 0.228746 hartree
zpe.thermalcorrenthalpy: 0.229691 hartree
zpe.thermalcorrgfe: 0.166633 hartree
zpe.sumelectzpe: -1000.926893 hartree
zpe.sumelectthermal: -1000.909938 hartree
zpe.sumelectthermalent: -1000.908994 hartree
zpe.sumelectthermalfe: -1000.972051 hartree
dipole: -0.1616 3.1272 0.9385
dipole: 3.2690
quadrupole: -113.6007 -111.0237 -107.4270
quadrupole: 13.4806 2.1516 0.8558
quadrupole: -2.9169 -0.3399 3.2568 13.4806 2.1516 0.8558
hfenergy: -1001.1386846 hartree
pointgroup: C01 [X(C8H11N3O7)]
dipole: 0.1364811 1.2654552 -0.1846087 debye
polarizability: 165.125948|-8.273329|112.4912859|-8.2658225|-14.2413614|107.0826274 unknown
InChI: InChI=1S/C8H11N3O7/c12-1-2-3(13)4(14)5(18-2)11-7(16)9-6(15)10-8(11)17/h2-5,9-10,12-14H,1H2
charge 0 multiplicity 1
29 atoms
O  -1.393064 -0.396132 -0.935913
O  -1.086528 2.851668 0.732143
O  -3.467542 0.914076 1.78348
O  -3.432022 -2.392002 -1.324901
O  1.700219 1.484449 -2.017564
O  0.119615 -1.114151 1.584778
O  4.618977 -1.295161 0.342517
N  0.844362 0.220917 -0.215575
N  3.143912 0.103971 -0.824921
N  2.357219 -1.194929 0.95415
C  -1.251149 1.403342 0.692547
C  -2.717803 0.925256 0.539859
C  -0.531447 0.707518 -0.500613
C  -2.559235 -0.509986 0.015646
C  -3.726859 -1.059655 -0.796217
C  1.881062 0.662008 -1.088034
C  1.037072 -0.721861 0.82548
C  3.467831 -0.834501 0.171987
H  -0.867438 1.053782 1.662021
H  -3.223066 1.55888 -0.228553
H  -0.400075 1.401294 -1.350706
H  -2.278925 -1.190669 0.838908
H  -3.977288 -0.349071 -1.6142
H  -4.605035 -1.18355 -0.141354
H  -1.373018 3.251988 -0.129811
H  -3.454356 1.823906 2.176378
H  3.907077 0.413224 -1.432033
H  2.518547 -1.876504 1.700183
H  -2.581342 -2.332809 -1.831479
