program: Gaussian 09
title: 000278189
version: EM64L-G09RevD.01
frameworkgroup: C1[X(C9H13N3O4)]
method: RPBEPBE
basis: SDD
operation: Freq
keyword: #p
keyword: freq=noraman
keyword: PBEPBE/SDD
title: #p freq=noraman PBEPBE/SDD
converged: YES YES NO NO
title: Mulliken charges:
elementType: O O O O N N N C C C C C C C C C H H H H H H H H H H H H H
charge: -0.257227 -0.464677 -0.439636 -0.296886 -0.176188 -0.080122 -0.628811 -0.118771 -0.513515 -0.084921 -0.049964 -0.383889 0.282356 -0.202472 -0.459880 0.221897 0.258295 0.247073 0.276944 0.281396 0.237030 0.232263 0.227056 0.346111 0.312253 0.344594 0.238305 0.318823 0.332561
chargesum: 0.00000
title: Mulliken charges with hydrogens summed into heavy atoms:
elementType: O O O O N N N C C C C C C C C C
charge: -0.257227 -0.118567 -0.095041 -0.296886 -0.176188 -0.080122 0.022573 0.139525 0.010503 0.152110 0.231432 0.075430 0.282356 0.109780 -0.221575 0.221897
polarizability: 1.81808519e+02 -8.69068770e+00 1.31615341e+02 -5.23040443e+00 9.66072527e+00 8.37296261e+01
1716.lowfreq: -4.7801 -0.0009 -0.0009 -0.0005 5.7282 10.8599 39.8111 45.8115 59.5735
frequency: 39.4807 45.6996 59.5219 96.9473 132.9766 150.6584 174.8574 175.8005 215.9518 243.4348 259.1635 284.5380 313.0332 343.0145 377.9724 392.0168 434.0559 446.6076 465.9614 487.9618 507.5971 517.5062 527.8990 588.4956 686.6499 698.9156 714.6300 732.0245 746.3356 766.8026 825.5149 831.2753 867.3656 869.3177 903.6608 944.9123 956.7371 970.4379 985.9262 1006.0333 1034.6808 1046.5986 1051.6482 1069.3266 1122.4119 1136.5215 1162.9058 1181.3709 1206.1870 1244.6162 1255.8895 1271.2379 1272.5488 1294.7177 1315.9785 1321.7786 1334.0128 1365.0547 1371.1825 1378.2813 1421.0354 1441.7463 1453.7159 1470.2408 1544.1894 1570.1687 1622.3839 1656.1164 3005.4190 3007.6433 3024.8512 3042.4149 3055.5331 3084.5091 3111.6012 3128.9393 3175.6033 3552.8631 3571.3164 3575.8090 3708.3221
redmass: 6.0531 5.1575 6.4882 4.0986 4.0453 5.8512 5.4075 4.6685 4.3286 4.7808 2.2419 1.2871 1.2355 3.4511 3.2805 3.5738 1.9747 1.5850 2.9595 3.0041 2.6531 2.0131 4.6718 6.5111 10.3480 4.2573 4.8471 3.3119 4.7118 5.7323 1.7733 3.0653 2.8256 3.6894 3.6487 3.0038 3.7571 1.3866 3.9501 2.8157 1.5090 2.9148 1.8273 2.2272 2.6890 1.3392 1.2632 1.6111 2.1815 2.0159 1.6527 2.4552 1.3604 1.2991 1.4230 1.2795 1.3442 1.2300 1.6544 1.4836 1.4049 2.7189 1.0901 1.0815 4.0603 3.0512 1.6714 8.3449 1.0616 1.0866 1.0822 1.0701 1.0846 1.1042 1.1025 1.0971 1.0923 1.0449 1.0662 1.0667 1.1048
irintensity: 0.7822 0.5020 3.3910 13.8598 0.5488 4.9096 2.3421 1.7996 21.2729 0.5554 35.1275 150.5282 123.9805 4.1585 6.8169 19.9016 158.5803 76.9405 22.0490 50.3485 19.3925 23.0782 11.5873 6.3186 6.5485 15.0938 9.1289 4.7461 14.0597 2.1653 58.8689 6.1850 50.0585 20.2358 8.9225 71.2165 48.6966 9.4260 168.1409 26.6465 2.8645 114.4214 12.7240 2.4317 88.9784 20.5970 48.6347 21.7860 11.2625 124.7912 53.3438 37.2940 11.3128 12.9269 2.6298 4.1852 17.3324 8.0973 5.7094 2.3264 46.5358 127.9771 19.1493 9.0016 102.4069 31.8686 198.3792 871.6294 31.1047 32.3995 16.6536 10.5680 23.3112 29.7137 8.0358 30.2913 7.2487 109.8031 7.1787 10.5370 39.5793
temp: 298.150 k
press: 1.00000 atm
elementType: 8 8 8 8 7 7 7 6 6 6 6 6 6 6 6 6 1 1 1 1 1 1 1 1 1 1 1 1 1
symmnumber: 1
zpe: 594837.5 jmol-1
zpe.correction: 0.226562 hartree
zpe.thermalcorrener: 0.241884 hartree
zpe.thermalcorrenthalpy: 0.242828 hartree
zpe.thermalcorrgfe: 0.183769 hartree
zpe.sumelectzpe: -814.677252 hartree
zpe.sumelectthermal: -814.661930 hartree
zpe.sumelectthermalent: -814.660985 hartree
zpe.sumelectthermalfe: -814.720044 hartree
dipole: -1.2520 -3.8009 -1.0824
dipole: 4.1456
quadrupole: -66.0417 -102.6056 -92.5313
quadrupole: -1.0457 3.5981 2.9617
quadrupole: 21.0178 -15.5461 -5.4718 -1.0457 3.5981 2.9617
hfenergy: -814.9038135 hartree
pointgroup: C01 [X(C9H13N3O4)]
dipole: 0.5353613 -0.6631959 -1.3905861 debye
polarizability: 180.9381247|-0.9701713|86.9230317|12.192327|15.3313785|129.2923297 unknown
InChI: InChI=1S/C9H13N3O4/c10-7-2-8(15)12(4-11-7)9-1-5(14)6(3-13)16-9/h2,4-6,9,13-14H,1,3,10H2
charge 0 multiplicity 1
29 atoms
O  1.180272 -0.90031 0.699884
O  1.837096 0.227844 -2.156705
O  4.943651 -0.758152 0.464517
O  -1.656728 0.911727 2.397145
N  -0.84687 0.321091 0.247316
N  -2.323722 -0.271847 -1.550138
N  -4.631749 -0.307271 -1.263229
C  2.44134 0.480933 -0.832429
C  1.465932 1.392898 -0.062059
C  2.497575 -0.795151 0.036587
C  0.537193 0.441845 0.743556
C  3.615558 -0.734286 1.100805
C  -1.934214 0.546341 1.211438
C  -1.110323 -0.072465 -1.049687
C  -3.242971 0.322508 0.658358
C  -3.407481 -0.07495 -0.676123
H  3.447439 0.923966 -0.952485
H  2.021577 2.041914 0.635098
H  0.908804 2.038625 -0.75814
H  0.419076 0.743687 1.79794
H  2.61503 -1.707783 -0.57985
H  3.481834 -1.563525 1.8220
H  3.579195 0.21816 1.65644
H  2.450836 -0.328131 -2.69927
H  -0.23874 -0.209653 -1.69982
H  5.174086 -1.689402 0.221227
H  -4.092999 0.472817 1.328261
H  -5.500386 -0.207753 -0.746503
H  -4.643508 -0.594579 -2.239535
