program: Gaussian 09
title: 000278200
version: EM64L-G09RevD.01
frameworkgroup: C1[X(C14H22O4)]
method: RPBEPBE
basis: SDD
operation: Freq
keyword: #pfreq=noraman
keyword: PBEPBE/SDD
title: #p freq=noraman PBEPBE/SDD
converged: YES YES NO NO
title: Mulliken charges:
elementType: O O O O C C C C C C C C C C C C C C H H H H H H H H H H H H H H H H H H H H H H
charge: -0.298494 -0.284143 -0.429010 -0.222361 0.236726 -0.574259 0.308918 0.339860 -0.491787 -0.585400 -0.521957 -0.435895 -0.558893 0.045843 0.083605 -0.832589 -0.539667 -0.536051 0.232791 0.240588 0.266436 0.211385 0.241442 0.228849 0.250177 0.244245 0.244875 0.215953 0.248167 0.225927 0.232592 0.220336 0.280376 0.343741 0.240128 0.233755 0.211052 0.231667 0.218510 0.232564
chargesum: 0.00000
title: Mulliken charges with hydrogens summed into heavy atoms:
elementType: O O O O C C C C C C C C C C C C C C
charge: -0.298494 -0.284143 -0.085270 -0.222361 0.236726 -0.100879 0.308918 0.339860 -0.013967 -0.115110 -0.027535 0.024933 -0.084799 0.045843 0.083605 -0.099286 0.145268 0.146690
polarizability: 2.02310378e+02 -2.25467946e+00 1.49517320e+02 1.23917539e+01 2.33300767e+00 1.34525564e+02
1716.lowfreq: -6.3429 0.0000 0.0007 0.0009 10.2119 17.4760 39.4614 75.2050 89.4049
frequency: 39.3593 75.1957 89.3731 98.7447 111.1867 117.3755 140.0792 143.0214 155.8484 162.5460 173.8011 200.5625 224.2825 269.8271 271.5922 285.3485 315.6731 323.5687 329.3297 332.9539 349.2791 365.9792 382.7228 425.2138 434.4825 459.2056 511.1139 521.9997 558.0367 570.2213 588.8896 612.0891 682.0006 688.0859 711.2866 774.8474 802.4495 834.1906 866.0058 885.0289 908.2424 940.1633 948.3158 971.0542 983.9419 999.2696 1001.7957 1017.1988 1032.7411 1034.2724 1051.5765 1085.4873 1094.9090 1106.1853 1112.3621 1113.5510 1117.7417 1137.3191 1146.5599 1155.7815 1170.0684 1179.5272 1204.0897 1213.1196 1263.3852 1264.6883 1278.2306 1296.5551 1304.1266 1311.9902 1327.6103 1335.4870 1351.7626 1354.2027 1368.6954 1392.8957 1418.5985 1428.0369 1441.0448 1449.8269 1456.4038 1461.4202 1465.0421 1468.4301 1471.1428 1472.3499 1481.7635 1486.8693 1488.6308 1494.2724 1583.6641 1620.9992 2961.4224 2963.7919 2971.7585 2978.2432 2986.0025 2988.0969 2990.2595 3016.5852 3020.5717 3049.1264 3052.0684 3055.3008 3056.5279 3061.4549 3071.1600 3074.4482 3080.9479 3084.3116 3096.7283 3108.3790 3109.7510 3537.5490
redmass: 5.3837 4.1844 3.7574 4.1200 2.9242 2.8100 1.1728 2.6368 1.5586 1.7587 1.2623 2.3722 2.7064 1.8703 2.3486 3.1464 1.9872 2.4620 2.8986 2.8880 4.1947 2.6902 2.2689 3.6525 3.8765 3.9149 3.0020 3.8196 3.1752 3.1970 3.3111 4.3732 3.7149 4.0271 3.2882 2.7519 2.1429 2.0174 2.4096 2.7836 2.3883 2.2177 2.5091 3.7294 5.3910 2.4926 2.4366 2.6955 1.7741 1.5926 3.0274 2.1130 2.2157 1.9753 1.2725 2.0554 1.3434 1.4621 1.5926 1.5628 1.9301 1.5337 1.5022 1.8559 1.5896 1.7012 1.8777 1.5206 1.3475 1.5868 1.5819 2.1312 1.5618 1.4367 1.2711 1.2193 1.1229 1.1380 1.0856 1.0813 1.0684 1.0851 1.0638 1.0771 1.0654 1.0828 1.0544 1.0623 1.0542 1.0759 9.9382 8.2283 1.0332 1.0325 1.0662 1.0392 1.0608 1.0670 1.0599 1.0604 1.0576 1.1005 1.1018 1.1016 1.1012 1.0946 1.0953 1.1005 1.0976 1.1053 1.0989 1.1017 1.1012 1.0657
irintensity: 1.4535 2.2327 1.1574 0.8015 2.1259 3.0742 1.3850 2.4494 5.6269 1.1799 0.0741 3.1605 10.4215 60.1416 27.7248 1.5874 17.9693 3.2936 25.7973 20.9920 27.0380 12.7315 0.5715 0.8338 1.4987 8.6845 0.7849 1.5647 6.8068 0.1131 0.1217 2.6204 1.4734 22.1716 7.2963 15.5788 15.9593 1.7167 2.0059 36.6473 7.6122 18.9089 1.3242 77.0278 56.4760 45.6250 54.2067 10.3607 16.4933 7.2560 153.4805 8.0243 15.8448 16.2178 2.3338 14.2738 2.3940 4.8733 4.5168 3.8566 22.6773 8.7294 29.5436 8.8271 6.0828 8.8572 11.3058 20.1404 7.5684 38.7179 25.1241 4.3159 17.3173 5.8177 17.5832 28.3805 6.5517 6.9571 2.1138 22.1593 17.0425 7.6557 1.9171 20.9048 10.4384 22.0493 10.2178 17.9687 13.8031 2.2322 221.6696 39.6166 76.4779 33.9492 14.9264 25.4349 6.9618 20.4693 40.9815 19.4196 26.8390 12.4239 34.8736 28.4339 41.7623 19.3387 25.0366 25.6962 31.0714 11.9931 2.4320 21.9680 23.6783 4.2526
temp: 298.150 k
press: 1.00000 atm
elementType: 8 8 8 8 6 6 6 6 6 6 6 6 6 6 6 6 6 6 1 1 1 1 1 1 1 1 1 1 1 1 1 1 1 1 1 1 1 1 1 1
symmnumber: 1
zpe: 887992.1 jmol-1
zpe.correction: 0.338218 hartree
zpe.thermalcorrener: 0.357341 hartree
zpe.thermalcorrenthalpy: 0.358285 hartree
zpe.thermalcorrgfe: 0.292475 hartree
zpe.sumelectzpe: -846.125408 hartree
zpe.sumelectthermal: -846.106286 hartree
zpe.sumelectthermalent: -846.105341 hartree
zpe.sumelectthermalfe: -846.171151 hartree
dipole: 5.3940 0.9734 -0.7158
dipole: 5.5277
quadrupole: -122.9479 -97.8896 -119.9965
quadrupole: -3.0994 -1.1319 5.9551
quadrupole: -9.3366 15.7217 -6.3851 -3.0994 -1.1319 5.9551
hfenergy: -846.4636267 hartree
pointgroup: C01 [X(C14H22O4)]
dipole: -2.1219961 0.4409043 0.1797545 debye
polarizability: 202.7128578|6.8641592|146.1166976|9.127001|-6.856016|137.5237062 unknown
InChI: InChI=1S/C14H22O4/c1-10-11-4-7-14(17-2,18-3)8-13(11,9-15)6-5-12(10)16/h15H,4-9H2,1-3H3
charge 0 multiplicity 1
40 atoms
O  -2.759919 -0.189386 -0.76725
O  -2.89787 0.403364 1.566294
O  1.035469 -1.39006 -2.643493
O  4.2264 0.253349 0.913419
C  0.299347 -0.869638 -0.284099
C  -0.957317 -0.889183 0.65219
C  0.830271 0.568812 -0.388533
C  -1.993621 0.234073 0.420774
C  1.369358 -1.86698 0.249975
C  -0.212662 1.587226 -0.821159
C  -1.338898 1.616486 0.249308
C  -0.10391 -1.36929 -1.717314
C  2.332424 -1.247333 1.27874
C  2.11469 0.940825 -0.047366
C  3.00406 -0.007932 0.698101
C  2.687402 2.330297 -0.280576
C  -3.827148 0.730295 -1.194837
C  -3.622579 -0.809768 1.977786
H  -1.461428 -1.867865 0.546066
H  -0.611497 -0.797382 1.700086
H  1.958912 -2.230184 -0.612229
H  0.855813 -2.744887 0.687492
H  0.22325 2.594321 -0.918334
H  -0.660623 1.324286 -1.79951
H  -0.918028 1.91384 1.226689
H  -2.108806 2.364013 -0.010824
H  -0.944667 -0.780096 -2.122274
H  -0.423558 -2.423549 -1.649008
H  3.112813 -1.963246 1.588925
H  1.785697 -0.938959 2.194321
H  2.316119 3.057965 0.467119
H  2.443974 2.723634 -1.28272
H  3.783797 2.282165 -0.172846
H  1.430298 -0.480808 -2.682328
H  -4.411556 1.089299 -0.327751
H  -4.470292 0.139095 -1.865735
H  -3.419902 1.596564 -1.752439
H  -4.402845 -0.46128 2.672366
H  -2.95673 -1.520932 2.504155
H  -4.085541 -1.312454 1.107915
