program: Gaussian 09
title: 000278201
version: EM64L-G09RevD.01
frameworkgroup: C1[X(C14H24O4)]
method: RPBEPBE
basis: SDD
operation: Freq
keyword: #pfreq=noraman
keyword: PBEPBE/SDD
title: #p freq=noraman PBEPBE/SDD
converged: YES YES NO NO
title: Mulliken charges:
elementType: O O O O C C C C C C C C C C C C C C H H H H H H H H H H H H H H H H H H H H H H H H
charge: -0.278153 -0.348671 -0.446243 -0.439869 0.305969 -0.644942 0.253520 -0.507891 0.370333 -0.579820 -0.503488 -0.491235 0.197345 -0.453236 -0.209959 -0.869827 -0.535961 -0.525631 0.231942 0.267397 0.197694 0.239289 0.218035 0.219591 0.232709 0.240102 0.226311 0.222261 0.197417 0.226230 0.202434 0.219965 0.251070 0.231849 0.369943 0.341695 0.227095 0.223621 0.229909 0.243142 0.217112 0.230944
chargesum: 0.00000
title: Mulliken charges with hydrogens summed into heavy atoms:
elementType: O O O O C C C C C C C C C C C C C C
charge: -0.278153 -0.348671 -0.076300 -0.098173 0.305969 -0.145602 0.253520 -0.070907 0.370333 -0.142193 -0.030677 -0.042663 0.197345 -0.029589 -0.007526 -0.166943 0.144664 0.165567
polarizability: 2.03420022e+02 7.04219391e+00 1.50148216e+02 -3.59923266e+00 3.43326299e+00 1.33825294e+02
1716.lowfreq: -18.7205 -9.8782 -0.0004 0.0005 0.0006 11.8416 46.2189 73.6224 88.6830
frequency: 46.2146 73.5884 88.6772 98.7040 110.2400 127.6163 141.3556 161.4622 178.6388 190.1851 198.2400 216.9148 241.5049 248.9434 275.1318 295.7363 306.2949 311.6726 315.3220 333.0500 339.2698 350.8868 385.8564 403.2977 439.5540 468.6584 488.7769 496.4354 528.7536 571.3404 591.5780 594.5104 662.2360 674.4004 689.5652 745.7192 795.0819 795.9427 830.2857 863.5346 883.1026 907.5396 920.3003 960.3123 961.5523 968.6216 987.8624 1003.7922 1006.4533 1017.7412 1027.8669 1033.6050 1056.3625 1072.9375 1093.7677 1108.4815 1110.6930 1115.1450 1131.1385 1134.1456 1145.4038 1156.9153 1172.7809 1183.0803 1199.5011 1219.9169 1223.4007 1248.7204 1263.5020 1277.4590 1292.1719 1294.9440 1314.3270 1332.0182 1338.2310 1345.2644 1354.6012 1360.5234 1378.7470 1392.2057 1394.0086 1419.8260 1428.2193 1447.0604 1454.2868 1458.3534 1466.1408 1469.0480 1472.3600 1472.8100 1474.8985 1475.8471 1481.8649 1486.8607 1489.4210 1665.4307 2898.6475 2956.8780 2967.0713 2967.9542 2969.4981 2972.0164 2989.3931 2999.5972 3005.9882 3012.8240 3027.0468 3033.9261 3058.1051 3063.7225 3064.6529 3065.1297 3067.8562 3070.7137 3072.4295 3092.7677 3108.5086 3109.5802 3383.9331 3561.9117
redmass: 4.0740 3.3912 3.3609 2.9358 2.7433 2.8721 4.1783 1.3056 1.1426 1.2470 3.5679 2.2266 3.1222 2.4369 2.4393 1.8209 3.5310 2.1155 2.1995 2.4764 3.6768 3.3384 2.2271 2.9286 3.3710 3.1129 3.1382 3.4509 3.3640 3.0664 3.9354 2.9127 3.2980 3.8997 2.9134 1.1702 2.5073 2.4256 2.1769 2.1536 2.5881 1.8433 3.8403 2.8735 1.8607 3.7410 5.3174 2.7611 2.7866 2.6310 1.6709 2.0412 2.8277 1.7342 1.7021 2.1244 1.3173 1.2780 1.5277 2.5999 1.4167 1.5318 1.7743 1.9678 1.7408 1.4419 1.3065 1.3271 1.9066 1.5719 1.7998 1.2832 1.3776 1.6982 1.5992 1.5015 1.5340 1.2445 1.7188 1.2541 1.1855 1.1272 1.1396 1.0801 1.0769 1.0713 1.0779 1.0706 1.0803 1.0688 1.0807 1.0569 1.0556 1.0550 1.0726 8.1874 1.0825 1.0415 1.0617 1.0323 1.0318 1.0685 1.0625 1.0593 1.0624 1.0604 1.0955 1.0971 1.1030 1.1013 1.1019 1.1017 1.0931 1.1004 1.0999 1.0929 1.1014 1.1025 1.0655 1.0660
irintensity: 0.6863 0.1220 1.0819 1.6310 3.3013 0.5831 1.4665 1.3290 6.4412 4.3764 6.1257 10.2784 15.7142 6.7690 20.2592 77.3650 20.6678 21.9482 5.5075 6.2076 13.2546 7.7645 0.7815 5.1651 1.2636 15.2796 1.9945 2.3546 2.8933 3.5392 1.1523 2.7153 2.1037 14.6356 12.1751 101.3755 15.8439 37.0843 4.8688 21.4659 39.5414 15.2774 10.2989 80.1142 18.1155 83.2934 88.5140 43.0285 51.8670 50.4985 7.2330 2.5945 122.0759 2.6980 6.9196 25.8119 1.3375 0.3540 4.1541 13.1023 9.6220 4.8753 5.8566 5.2285 7.7787 39.1237 15.3125 13.2585 2.2942 12.2999 4.8264 8.5161 2.9421 20.4334 14.3511 2.4850 17.0303 4.6431 4.9241 14.1954 36.4301 6.9068 8.3366 4.3310 2.7761 10.6970 15.6062 2.3586 16.7482 18.6333 5.2779 12.2950 8.9898 10.7687 13.6811 1.1780 50.6549 54.7999 19.5242 88.9304 37.0420 9.2745 61.4183 15.1595 21.7711 27.6494 20.4935 27.1433 30.3539 59.5528 7.6725 51.6465 31.6181 24.8040 31.9100 29.5003 30.6666 14.7555 157.1936 4.6095
temp: 298.150 k
press: 1.00000 atm
elementType: 8 8 8 8 6 6 6 6 6 6 6 6 6 6 6 6 6 6 1 1 1 1 1 1 1 1 1 1 1 1 1 1 1 1 1 1 1 1 1 1 1 1
symmnumber: 1
zpe: 949517.3 jmol-1
zpe.correction: 0.361652 hartree
zpe.thermalcorrener: 0.380875 hartree
zpe.thermalcorrenthalpy: 0.381819 hartree
zpe.thermalcorrgfe: 0.316293 hartree
zpe.sumelectzpe: -847.291764 hartree
zpe.sumelectthermal: -847.272540 hartree
zpe.sumelectthermalent: -847.271596 hartree
zpe.sumelectthermalfe: -847.337123 hartree
dipole: -1.6776 3.5186 -1.5122
dipole: 4.1811
quadrupole: -103.0380 -114.4214 -108.9415
quadrupole: 6.9508 -6.6845 8.9918
quadrupole: 5.7623 -5.6211 -0.1412 6.9508 -6.6845 8.9918
hfenergy: -847.6534156 hartree
pointgroup: C01 [X(C14H24O4)]
dipole: -0.7315906 1.3421917 -0.6076203 debye
polarizability: 202.5401478|9.5177458|151.0333317|-4.6202852|2.8996356|133.8200535 unknown
InChI: InChI=1S/C14H24O4/c1-10-11-4-7-14(17-2,18-3)8-13(11,9-15)6-5-12(10)16/h12,15-16H,4-9H2,1-3H3
charge 0 multiplicity 1
42 atoms
O  -3.137194 0.523482 -1.288966
O  -2.545599 -0.210633 0.924772
O  -0.937289 -2.381383 1.413954
O  4.524574 0.118111 0.137893
C  0.355805 -0.729998 -0.034361
C  -0.980888 -0.67992 -0.845419
C  0.910525 0.695123 0.146294
C  1.333279 -1.636669 -0.836035
C  -2.024688 0.338082 -0.356418
C  -0.120404 1.69708 0.663368
C  -1.403391 1.734692 -0.202844
C  2.79012 -1.457298 -0.381042
C  2.212421 1.025671 -0.127016
C  0.123898 -1.377242 1.391466
C  3.239896 -0.010896 -0.598816
C  2.7934 2.427455 -0.012301
C  -3.837639 -0.705521 -1.696242
C  -3.55689 0.606241 1.612469
H  -0.740412 -0.394313 -1.886857
H  -1.408274 -1.698377 -0.861314
H  1.259661 -1.397498 -1.917222
H  1.014797 -2.689967 -0.715822
H  -0.407837 1.4203 1.698682
H  0.297572 2.714764 0.727109
H  -2.145556 2.435568 0.220244
H  -1.164116 2.094715 -1.220065
H  2.9038 -1.684814 0.69518
H  3.465964 -2.140889 -0.925692
H  -0.086285 -0.588881 2.139916
H  1.040106 -1.907559 1.700065
H  3.438509 0.166304 -1.682751
H  3.448844 2.647746 -0.88026
H  3.410864 2.534319 0.900769
H  2.025114 3.215761 0.015489
H  -1.788255 -1.858957 1.350211
H  4.955259 0.975142 -0.110156
H  -4.096723 -1.329354 -0.820046
H  -3.23217 -1.299816 -2.406391
H  -4.756182 -0.363109 -2.19819
H  -4.310454 0.975639 0.89363
H  -3.091861 1.460765 2.140305
H  -4.030801 -0.062365 2.348508
