program: Gaussian 09
title: 000278270
version: EM64L-G09RevD.01
frameworkgroup: C1[X(C22H19NO4)]
method: RPBEPBE
basis: SDD
operation: Freq
keyword: #p
keyword: freq=noraman
keyword: PBEPBE/SDD
title: #p freq=noraman PBEPBE/SDD
converged: YES YES NO NO
title: Mulliken charges:
elementType: O O O O N C C C C C C C C C C C C C C C C C C C C C C H H H H H H H H H H H H H H H H H H H
charge: -0.454555 -0.264500 -0.260914 -0.264770 -0.481555 -0.233541 -0.666278 0.502097 0.346958 -0.534736 0.305221 -0.409234 0.206502 0.165529 -0.392783 -0.312626 -0.356442 -0.262869 -0.205742 -0.237619 0.116121 0.253342 -0.352262 -0.336108 -0.221766 -0.245082 -0.231361 0.228650 0.228364 0.224292 0.272048 0.285049 0.228091 0.251234 0.310710 0.341149 0.338341 0.227164 0.236579 0.240908 0.228840 0.271737 0.219169 0.231700 0.232231 0.232717
chargesum: 0.00000
title: Mulliken charges with hydrogens summed into heavy atoms:
elementType: O O O O N C C C C C C C C C C C C C C C C C C C C C C
charge: -0.113406 -0.264500 -0.260914 -0.264770 -0.143214 -0.004891 -0.213622 0.502097 0.346958 -0.262688 0.305221 -0.124185 0.206502 0.165529 -0.164692 -0.061391 -0.045732 -0.035705 0.271745 -0.008779 0.116121 0.253342 -0.080525 -0.116939 0.009934 -0.012850 0.001355
polarizability: 3.40146526e+02 -1.40006866e+01 1.59389474e+02 -4.52192765e+00 6.70372354e+00 2.60327027e+02
1716.lowfreq: -1.9006 -0.0008 -0.0007 -0.0005 3.3676 5.8627 15.5131 20.7916 29.6718
frequency: 15.3517 20.7738 29.5998 36.4646 48.6157 56.8410 83.3188 89.7170 101.4732 112.0793 149.9661 172.0174 183.1748 210.5970 225.8031 236.6737 266.1779 275.4798 303.9333 314.7704 329.5115 371.2855 391.1233 402.3407 403.6729 413.1244 432.1138 439.5998 471.8509 494.3207 540.5283 550.6439 575.8028 602.0551 614.5889 623.6975 628.2525 648.9922 669.4599 677.7594 689.4896 703.0898 710.2477 719.8836 738.2654 769.3947 775.9421 784.6950 796.1173 825.0953 834.6705 845.4555 854.7481 869.3615 872.0711 875.2787 888.5037 934.8019 943.3567 949.9679 956.3775 971.5179 982.9932 989.7823 991.9817 999.2798 1003.2405 1003.8745 1024.3466 1047.9688 1057.8011 1073.4167 1074.2713 1085.9223 1107.4944 1125.4442 1130.6120 1154.4498 1160.3979 1173.8819 1174.7805 1190.7249 1192.2869 1201.8535 1244.4107 1247.5941 1265.9269 1272.9489 1282.3632 1300.4056 1302.0251 1319.3599 1362.8362 1374.0859 1381.6913 1384.8075 1411.4311 1432.2884 1438.6511 1443.3023 1458.5884 1475.9619 1480.6762 1483.4244 1487.1908 1514.3545 1575.7064 1592.8517 1609.5560 1610.6817 1611.5960 1615.1147 1627.1494 2957.7505 2971.9500 3000.6325 3031.9254 3110.5519 3113.4030 3120.6685 3132.5664 3136.4610 3145.0382 3157.7182 3160.2212 3162.1914 3167.1550 3169.7153 3184.7271 3192.8266 3496.8005 3558.5734
redmass: 6.4940 6.0458 5.1181 6.0617 5.7986 5.1624 4.9020 4.0795 4.0407 3.3439 4.8235 5.7958 5.5099 5.2479 5.6592 4.7751 4.3120 3.5082 1.4181 4.6294 6.3114 5.9925 4.2119 4.6100 2.8203 3.8751 3.9457 2.9734 4.2031 3.5982 3.5748 5.1937 5.7765 5.7788 6.3336 5.0079 3.9397 1.3317 6.2271 8.6962 4.5713 1.5368 4.5201 3.9887 4.4047 1.3465 6.4166 3.1686 3.0477 1.4849 5.0247 3.4811 1.3920 3.9100 3.0108 1.6389 1.6371 1.4530 1.8495 1.4833 1.3912 5.7870 1.4073 5.5730 5.0962 1.3456 2.9149 1.3621 2.5471 2.2002 3.3247 1.5953 2.4574 1.6539 2.1097 1.3880 1.1012 1.4010 1.1873 1.0585 1.1073 1.1165 1.3126 1.9607 3.6095 3.9367 1.3828 1.7861 1.3566 1.2984 1.6213 1.3565 1.2910 3.4435 3.2781 8.5808 2.4896 2.2758 2.5399 3.9554 1.8312 1.8328 1.6641 1.6052 1.6196 2.2168 6.2866 5.7241 5.8967 5.8620 6.0814 5.3502 8.0292 1.0849 1.0612 1.0611 1.1003 1.0884 1.1102 1.0865 1.0873 1.0890 1.0922 1.0957 1.0982 1.0888 1.0931 1.1007 1.0965 1.0950 1.0762 1.0660
irintensity: 0.2166 0.8950 0.0452 3.5533 0.5025 0.1175 0.5280 4.3957 10.9935 5.6791 0.2935 0.1660 2.4431 2.3311 0.3767 8.1736 13.6593 30.8890 109.7298 9.2832 2.4669 9.7917 3.9666 5.4099 0.3568 3.9164 0.9726 1.5643 5.6618 32.5049 2.8133 10.0429 10.8628 1.0867 1.1039 10.1914 21.3735 70.0146 14.3001 1.6389 12.2744 102.5449 5.9436 4.5007 7.6446 91.4666 17.2185 6.7676 11.3572 59.0894 33.1708 2.3662 5.1668 14.6337 9.2780 29.9735 2.8808 2.6417 10.6829 1.1502 4.4036 149.2423 1.8723 2.2637 41.5238 2.9285 3.7946 1.1093 10.5596 13.8702 13.7243 6.0781 8.5108 18.9195 6.4798 12.7255 2.3640 33.0610 8.9014 1.2118 0.6654 8.5657 79.7122 8.1731 62.7916 155.5405 11.4990 53.4989 3.8283 10.1191 90.4690 8.6787 2.3990 47.8225 32.5603 5.1374 18.5948 19.3089 93.9280 81.1554 25.6310 29.1743 16.9718 24.8239 63.2551 305.0384 62.3115 43.0275 30.4859 12.8545 26.3310 0.5964 0.3955 26.4842 42.8832 94.0671 30.4707 13.2972 31.8428 9.5021 2.3432 12.7305 21.7896 15.3543 31.7280 0.8287 1.6145 22.2314 2.4831 11.9030 73.7473 7.0481
temp: 298.150 k
press: 1.00000 atm
elementType: 8 8 8 8 7 6 6 6 6 6 6 6 6 6 6 6 6 6 6 6 6 6 6 6 6 6 6 1 1 1 1 1 1 1 1 1 1 1 1 1 1 1 1 1 1 1
symmnumber: 1
zpe: 939346.9 jmol-1
zpe.correction: 0.357778 hartree
zpe.thermalcorrener: 0.380860 hartree
zpe.thermalcorrenthalpy: 0.381804 hartree
zpe.thermalcorrgfe: 0.302726 hartree
zpe.sumelectzpe: -1203.473056 hartree
zpe.sumelectthermal: -1203.449975 hartree
zpe.sumelectthermalent: -1203.449030 hartree
zpe.sumelectthermalfe: -1203.528109 hartree
dipole: 0.6169 0.8889 2.4191
dipole: 2.6500
quadrupole: -131.5822 -173.6624 -144.0018
quadrupole: -2.3789 5.1445 -12.0633
quadrupole: 18.1666 -23.9136 5.7470 -2.3789 5.1445 -12.0633
hfenergy: -1203.8308344 hartree
pointgroup: C01 [X(C22H19N1O4)]
dipole: 0.1841211 -0.7402599 -0.7107304 debye
polarizability: 333.0267612|-29.5154841|182.768115|23.2244329|36.7171122|244.0681515 unknown
InChI: InChI=1S/C22H19NO4/c24-19(17-10-11-20-21(13-17)27-14-26-20)12-16-8-4-5-9-18(16)23-22(25)15-6-2-1-3-7-15/h1-11,13,19,23-24H,12,14H2
charge 0 multiplicity 1
46 atoms
O  1.608233 -3.075169 -2.346347
O  -0.673798 -1.901974 3.193148
O  -2.792987 -1.785379 2.077483
O  -0.126964 3.060293 0.746886
N  0.660852 1.129777 -0.353532
C  1.906625 -2.279536 -1.141544
C  2.450588 -0.874251 -1.57398
C  0.62322 -2.198749 -0.329386
C  2.859673 0.034376 -0.421649
C  0.703462 -2.123751 1.091728
C  1.988692 1.018099 0.150841
C  -0.63255 -2.141662 -0.984807
C  -0.494483 -1.966994 1.788834
C  -1.742913 -1.899725 1.131464
C  4.170651 -0.087792 0.09951
C  -1.846216 -1.995719 -0.257483
C  2.459613 1.856811 1.198796
C  4.636052 0.730114 1.150997
C  -2.110005 -1.563097 3.380272
C  3.771683 1.708419 1.690704
C  -0.293185 2.116583 -0.08846
C  -1.578465 1.98361 -0.868385
C  -2.740946 2.577953 -0.313679
C  -1.664488 1.343468 -2.132813
C  -3.973816 2.507293 -0.993646
C  -2.897968 1.279643 -2.817263
C  -4.057393 1.853551 -2.246369
H  2.694544 -2.778206 -0.537389
H  1.69437 -0.409137 -2.235541
H  3.344739 -1.049841 -2.206001
H  1.661488 -2.176432 1.616179
H  -0.660266 -2.253786 -2.072265
H  4.843966 -0.830973 -0.347028
H  -2.815167 -1.955775 -0.76093
H  1.787066 2.612771 1.607012
H  2.424213 -3.132263 -2.905548
H  0.327348 0.331397 -0.900566
H  5.656201 0.614537 1.532051
H  -2.194544 -0.494403 3.65425
H  -2.542774 -2.240128 4.132064
H  4.115047 2.361795 2.500353
H  -2.648082 3.096814 0.645917
H  -0.76962 0.927826 -2.611692
H  -4.86731 2.962251 -0.552437
H  -2.951836 0.794683 -3.798159
H  -5.014049 1.802577 -2.778088
