program: Gaussian 09
title: 000278187
version: EM64L-G09RevD.01
frameworkgroup: C1[X(C9H13N3O7)]
method: RPBEPBE
basis: SDD
operation: Freq
keyword: #p
keyword: freq=noraman
keyword: PBEPBE/SDD
title: #p freq=noraman PBEPBE/SDD
converged: YES YES NO NO
title: Mulliken charges:
elementType: O O O O O O O N N N C C C C C C C C C H H H H H H H H H H H H H
charge: -0.280196 -0.418512 -0.426690 -0.435509 -0.242621 -0.243891 -0.233238 -0.226812 -0.213837 -0.400198 -0.231051 -0.136890 -0.052632 -0.041578 -0.347416 0.352155 0.258653 0.194389 -0.584753 0.326952 0.202971 0.253578 0.288457 0.183630 0.239084 0.338469 0.357596 0.379729 0.352608 0.269203 0.261071 0.257278
chargesum: 0.00000
title: Mulliken charges with hydrogens summed into heavy atoms:
elementType: O O O O O O O N N N C C C C C C C C C
charge: -0.280196 -0.080043 -0.069095 -0.082901 -0.242621 -0.243891 -0.233238 -0.226812 -0.213837 -0.020470 0.095901 0.066081 0.200946 0.246880 0.075298 0.352155 0.258653 0.194389 0.202799
polarizability: 1.74465172e+02 2.05586226e+00 1.32270242e+02 -6.32586787e+00 1.58451902e+01 1.10875632e+02
1716.lowfreq: -12.8768 -7.1304 0.0005 0.0006 0.0009 1.4443 39.2201 40.2389 52.9329
frequency: 39.1673 40.0764 52.9308 78.3347 82.5576 100.8844 102.2810 147.3522 159.0653 170.5323 174.4138 211.5290 235.6353 253.4818 293.6333 309.8135 323.5562 331.5700 364.1566 382.0465 383.2769 398.9344 421.2830 433.5191 459.2024 495.9391 532.2040 553.6963 574.2985 617.1845 630.0113 655.1552 689.0169 705.2341 722.7289 742.4820 756.6810 801.5816 909.9003 936.3123 957.7706 981.9392 1004.3345 1019.2908 1027.1430 1045.2743 1052.5326 1086.6990 1101.2398 1120.1908 1134.4623 1158.9602 1179.0552 1187.7363 1188.3086 1224.1297 1234.2407 1253.3665 1271.6440 1287.8064 1306.3991 1334.4831 1351.5423 1357.6268 1372.9732 1373.8762 1377.8999 1382.7636 1403.9342 1410.1063 1441.8457 1456.5707 1474.0182 1482.5286 1613.2116 1669.8440 1681.8374 2911.5828 2953.1202 3020.8467 3033.6138 3055.0604 3087.7853 3108.9846 3115.8114 3148.9220 3532.3239 3552.2735 3554.9939 3558.8933
redmass: 6.3980 8.0546 6.3532 5.7885 5.8269 4.8917 1.0516 6.7556 2.9609 10.9909 7.9902 4.1467 5.3283 4.8104 2.0740 4.1227 1.8405 3.2380 1.3139 6.9947 5.3004 5.5615 2.1170 1.8047 7.9384 4.1752 5.9791 6.0003 3.8074 7.8716 8.0296 1.8580 4.7958 11.0104 4.7918 5.9376 3.1828 2.9259 5.0441 3.9448 6.8776 3.0022 3.1145 3.4570 2.6965 4.3273 2.9862 3.6529 3.6310 2.2944 1.3026 4.0518 1.9270 1.6928 1.6947 1.3719 2.8571 1.2158 1.2911 1.2730 1.2829 1.2450 1.4102 2.4434 1.3734 2.2980 2.1075 1.4367 1.5516 1.5374 1.3938 1.0846 1.0423 1.1110 10.4436 5.6148 10.4693 1.0824 1.0691 1.0331 1.0854 1.0851 1.0947 1.0864 1.1029 1.1026 1.0661 1.0658 1.0778 1.0662
irintensity: 1.8889 0.5898 1.6740 0.2970 0.9719 2.8551 0.0248 0.5485 0.7643 10.2116 0.3037 2.9216 21.9632 5.0975 21.3135 10.7642 18.5388 3.3669 265.0984 19.2221 28.5139 0.8022 92.2064 129.6382 9.7729 3.0445 23.0917 29.7505 4.4632 9.6270 3.3530 37.1033 0.3972 0.6994 1.6749 9.4863 114.1831 38.5788 98.4393 68.7975 223.1302 3.5608 37.2721 12.7865 42.2245 10.1212 34.4445 124.9127 3.2139 6.7408 0.0833 12.2607 13.1932 23.7040 22.9072 32.6073 27.1250 10.9348 28.5763 38.9456 20.8015 22.2084 20.9337 203.4105 7.6150 293.3210 104.5957 48.3794 9.6689 12.3882 196.1534 5.7162 20.5258 13.1508 680.9260 718.1728 41.9788 48.0317 68.3632 16.0361 11.5373 6.5591 16.6500 1.3684 11.7912 0.2688 9.1040 9.7801 102.3315 12.3069
temp: 298.150 k
press: 1.00000 atm
elementType: 8 8 8 8 8 8 8 7 7 7 6 6 6 6 6 6 6 6 6 1 1 1 1 1 1 1 1 1 1 1 1 1
symmnumber: 1
zpe: 627521.8 jmol-1
zpe.correction: 0.239010 hartree
zpe.thermalcorrener: 0.257669 hartree
zpe.thermalcorrenthalpy: 0.258614 hartree
zpe.thermalcorrgfe: 0.191756 hartree
zpe.sumelectzpe: -1040.146064 hartree
zpe.sumelectthermal: -1040.127405 hartree
zpe.sumelectthermalent: -1040.126461 hartree
zpe.sumelectthermalfe: -1040.193319 hartree
dipole: -0.3002 2.5081 -0.8029
dipole: 2.6506
quadrupole: -117.6458 -115.7612 -113.8784
quadrupole: 16.3141 -1.2806 2.6150
quadrupole: -1.8840 0.0006 1.8834 16.3141 -1.2806 2.6150
hfenergy: -1040.3850747 hartree
pointgroup: C01 [X(C9H13N3O7)]
dipole: 0.1780073 -0.9995347 -0.2381381 debye
polarizability: 173.5732088|5.3458979|130.2528878|8.9709602|-16.7174104|113.7849502 unknown
InChI: InChI=1S/C9H13N3O7/c1-11-7(16)10-8(17)12(9(11)18)6-5(15)4(14)3(2-13)19-6/h3-6,10,13-15H,2H2,1H3
charge 0 multiplicity 1
32 atoms
O  -1.556791 0.239678 1.05667
O  -1.38468 -2.679575 -1.155037
O  -3.573303 -0.418553 -1.930156
O  -3.465577 2.289324 1.7107
O  0.130804 1.260833 -1.203272
O  1.326657 -2.075453 1.893911
O  4.571615 0.8186 0.227678
N  0.669298 -0.425868 0.336312
N  2.346778 1.076067 -0.508115
N  2.923399 -0.620242 1.029868
C  -1.451962 -1.252621 -0.859215
C  -2.88867 -0.70022 -0.680555
C  -0.752424 -0.83696 0.468151
C  -2.659607 0.6061 0.094453
C  -3.82699 1.095967 0.944252
C  0.991399 0.673424 -0.501772
C  1.615732 -1.11125 1.143692
C  3.370416 0.458091 0.244367
C  2.696969 2.226323 -1.375152
H  -0.993701 -0.766252 -1.732252
H  -3.472782 -1.41755 -0.055088
H  -0.721113 -1.677392 1.185267
H  -2.289994 1.3947 -0.584427
H  -4.167834 0.276266 1.613958
H  -4.659695 1.399715 0.288802
H  -1.728414 -3.204034 -0.385639
H  -3.595587 -1.244463 -2.477693
H  3.635284 -1.096885 1.588877
H  -2.64827 2.075243 2.230317
H  3.771655 2.420033 -1.250401
H  2.109417 3.109786 -1.0795
H  2.470069 1.988269 -2.426603
