program: Gaussian 09
title: 000278184
version: EM64L-G09RevD.01
frameworkgroup: C1[X(C13H14N2O3)]
method: RPBEPBE
basis: SDD
operation: Freq
keyword: #p
keyword: freq=noraman
keyword: PBEPBE/SDD
title: #p freq=noraman PBEPBE/SDD
converged: YES YES NO NO
title: Mulliken charges:
elementType: O O O N N C C C C C C C C C C C C C H H H H H H H H H H H H H H
charge: -0.255790 -0.273739 -0.164233 -0.273312 0.007202 0.188694 -0.009062 0.057183 0.280078 -0.372142 -0.316909 -0.342459 -0.217319 -0.271395 -0.236198 -0.536570 -0.218266 -0.514821 0.264724 0.258435 0.300263 0.272835 0.239151 0.237383 0.246455 0.249781 0.214264 0.236838 0.265707 0.240923 0.220508 0.221790
chargesum: 0.00000
title: Mulliken charges with hydrogens summed into heavy atoms:
elementType: O O O N N C C C C C C C C C C C C C
charge: -0.255790 -0.273739 -0.164233 -0.007605 0.007202 0.188694 -0.009062 0.057183 0.280078 0.151016 -0.016645 -0.069623 -0.217319 -0.032245 0.001185 0.173931 0.018571 0.168401
polarizability: 1.94735001e+02 1.18920602e+01 1.28802813e+02 -9.84003136e+00 2.94536359e+00 1.54361212e+02
1716.lowfreq: -7.5804 -0.0005 0.0001 0.0004 4.9876 8.5955 23.5248 47.7456 61.0770
frequency: 23.5178 47.7413 61.0650 73.7999 96.8806 111.9964 128.0619 134.2020 137.7269 156.9259 167.5201 172.6018 186.4145 219.0329 240.9285 282.2086 302.2528 364.0095 372.4902 394.2339 406.3478 420.6592 433.6927 450.6587 493.3232 528.5590 607.7786 613.0790 662.3057 673.9694 700.2355 724.4076 779.6156 802.1377 859.6185 864.1943 900.1512 907.5630 954.8690 963.3577 987.5911 996.4626 999.0824 1010.8244 1012.8917 1028.7415 1034.7408 1060.7735 1078.5140 1094.8307 1116.8962 1118.8241 1153.6697 1160.8302 1176.7389 1204.3207 1232.0878 1239.5574 1274.8030 1335.8967 1345.7933 1386.6758 1428.3291 1434.6331 1437.0353 1439.1434 1458.7651 1461.2750 1473.9160 1477.3938 1482.2765 1573.6157 1598.0202 1612.0448 1628.0469 2183.4085 2948.5629 2961.7043 2986.1789 3032.9706 3053.9249 3062.4562 3116.7129 3125.0714 3132.5281 3142.2044 3150.5130 3161.1943 3171.4494 3276.8517
redmass: 5.4368 3.7325 4.4331 4.2905 5.2400 4.2058 2.8867 3.4926 4.7787 4.2618 2.8679 1.2537 2.0884 4.1687 3.0908 5.6104 4.2289 5.4738 3.8625 4.1309 3.2848 4.0134 5.6160 4.8630 4.3810 8.0652 6.7940 6.6038 6.5496 5.0275 1.7241 3.8077 2.3530 3.1463 5.9562 1.2453 2.2629 4.9404 1.8133 3.3223 4.7318 1.6296 2.2283 1.3462 2.5630 2.7948 2.5883 3.7169 3.4789 1.6532 1.2605 1.2785 1.4279 1.4921 1.0618 1.1408 4.2188 1.2325 1.5431 1.3285 1.4922 7.5014 1.0950 1.1641 2.1343 1.1216 1.0509 1.0523 1.0525 1.0541 2.0861 6.4154 7.3485 6.7211 7.6447 12.6770 1.0334 1.0336 1.0620 1.1032 1.1023 1.0999 1.0994 1.1005 1.0858 1.0893 1.0931 1.0965 1.1014 1.0734
irintensity: 1.8643 2.9788 2.3853 3.3396 1.9067 2.8265 3.8025 3.2166 1.8954 3.3310 1.5919 0.2939 1.0296 9.1359 11.4980 3.9528 12.8419 4.6832 5.0106 0.0527 0.4680 3.4560 3.9494 1.7374 2.3461 0.2621 5.9009 1.4679 28.9289 12.3160 77.8191 23.0173 26.8914 21.7304 7.6524 0.3551 112.3627 36.5684 22.6298 40.0437 2.2249 4.6163 11.7512 1.0938 17.6947 62.3265 82.0389 50.1729 31.5255 13.1513 0.3419 2.2791 12.4341 1.7073 1.7845 19.1896 187.1084 11.5139 28.4303 0.2318 16.8336 3.7570 16.4691 1.4331 25.6421 8.0460 11.1221 14.8697 12.1825 12.8738 2.4949 74.8168 100.1755 28.5905 23.2377 4.2551 44.7076 49.2741 8.4703 48.7931 39.4565 7.2352 24.8435 13.8119 1.4476 11.2302 1.6820 10.5915 30.1115 2.3723
temp: 298.150 k
press: 1.00000 atm
elementType: 8 8 8 7 7 6 6 6 6 6 6 6 6 6 6 6 6 6 1 1 1 1 1 1 1 1 1 1 1 1 1 1
symmnumber: 1
zpe: 642878.6 jmol-1
zpe.correction: 0.244860 hartree
zpe.thermalcorrener: 0.263223 hartree
zpe.thermalcorrenthalpy: 0.264167 hartree
zpe.thermalcorrgfe: 0.197718 hartree
zpe.sumelectzpe: -837.541503 hartree
zpe.sumelectthermal: -837.523139 hartree
zpe.sumelectthermalent: -837.522195 hartree
zpe.sumelectthermalfe: -837.588644 hartree
dipole: 0.6713 3.1284 0.2637
dipole: 3.2104
quadrupole: -86.6921 -107.5570 -113.5455
quadrupole: 9.1091 -0.2835 -5.4658
quadrupole: 15.9061 -4.9588 -10.9473 9.1091 -0.2835 -5.4658
hfenergy: -837.7863625 hartree
pointgroup: C01 [X(C13H14N2O3)]
dipole: -0.9230152 0.8501733 -0.1435467 debye
polarizability: 183.6196257|25.185304|137.2253121|-10.8671491|-7.5955635|157.0540877 unknown
InChI: InChI=1S/C13H14N2O3/c1-17-8-11(15)13(9-14,18-2)12(16)10-6-4-3-5-7-10/h3-7,15H,8H2,1-2H3
charge 0 multiplicity 1
32 atoms
O  2.29299 -0.04235 -1.205947
O  0.868941 3.855782 -0.149013
O  -0.105449 0.022212 -2.23713
N  0.855104 1.647195 1.63513
N  1.730299 -1.845518 1.64181
C  1.229793 0.028733 -0.189133
C  1.145536 1.464871 0.381402
C  -0.118237 -0.230596 -1.007051
C  -1.341645 -0.711417 -0.302196
C  1.384212 2.582624 -0.64691
C  -1.527245 -0.628438 1.106845
C  -2.380987 -1.249238 -1.115782
C  1.457978 -0.991607 0.854767
C  -2.73275 -1.08227 1.681897
C  -3.574297 -1.712588 -0.532809
C  3.664464 -0.006738 -0.657149
C  -3.752955 -1.630393 0.870353
C  -0.576425 4.014447 -0.382416
H  0.951039 2.304497 -1.628516
H  2.468634 2.734001 -0.790871
H  -0.758103 -0.187776 1.749148
H  -2.225106 -1.297563 -2.198453
H  -2.873065 -1.010557 2.765418
H  -4.36239 -2.137789 -1.163214
H  4.313786 0.010088 -1.5450
H  3.877094 -0.908325 -0.053149
H  3.842645 0.896656 -0.040362
H  -4.68154 -1.991315 1.326629
H  0.811012 2.66712 1.861813
H  -0.838305 5.004374 0.020932
H  -1.167486 3.233618 0.138769
H  -0.804542 3.980057 -1.46611
