program: Gaussian 09
title: 000278266
version: EM64L-G09RevD.01
frameworkgroup: C1[X(C22H17NO4)]
method: RPBEPBE
basis: SDD
operation: Freq
keyword: #p
keyword: freq=noraman
keyword: PBEPBE/SDD
title: #p freq=noraman PBEPBE/SDD
converged: YES YES NO NO
title: Mulliken charges:
elementType: O O O O N C C C C C C C C C C C C C C C C C C C C C C H H H H H H H H H H H H H H H H H
charge: -0.255154 -0.254249 -0.188961 -0.252517 -0.487154 -0.730488 0.380450 0.352856 0.086928 0.306747 0.213782 -0.470614 0.162468 -0.374981 -0.384616 -0.328790 -0.360183 -0.208603 -0.254295 -0.239284 0.115407 0.234565 -0.350814 -0.369081 -0.225512 -0.218855 -0.257574 0.238941 0.260293 0.261651 0.289314 0.233240 0.262748 0.299738 0.330097 0.249673 0.246494 0.228158 0.228327 0.273376 0.252186 0.233556 0.236431 0.234300
chargesum: 0.00000
title: Mulliken charges with hydrogens summed into heavy atoms:
elementType: O O O O N C C C C C C C C C C C C C C C C C C C C C C
charge: -0.255154 -0.254249 -0.188961 -0.252517 -0.157057 -0.231255 0.380450 0.352856 0.086928 0.306747 0.213782 -0.208963 0.162468 -0.085667 -0.151377 -0.066043 -0.060445 0.287565 -0.026137 -0.010957 0.115407 0.234565 -0.077437 -0.116894 0.008044 0.017576 -0.023274
polarizability: 3.86083323e+02 3.92998108e+01 2.37618958e+02 -3.15500049e-01 1.91351935e+01 1.61643418e+02
1716.lowfreq: -3.9908 -2.2801 -0.0008 -0.0008 -0.0007 7.2306 11.5110 24.2720 40.3355
frequency: 11.4296 24.1262 40.3161 41.7886 56.5787 67.1227 75.2866 84.8625 98.2429 120.2319 136.9399 153.0160 173.7334 216.9193 223.8241 238.5758 290.8887 302.0286 309.3933 323.6098 370.1323 400.6412 406.2104 413.9649 417.8862 440.3166 457.4133 483.0083 522.3245 534.4857 559.9437 574.0417 593.4774 603.5188 614.0198 646.9396 664.1821 673.2216 685.2498 688.6346 709.3075 715.2826 728.1498 753.4211 765.3196 782.9635 790.0984 803.5549 827.6483 839.3392 848.7389 862.7486 865.8593 875.9166 878.4696 890.5259 925.8252 942.4877 954.6244 970.3751 973.5055 988.0083 988.4673 990.9025 992.9406 1006.4891 1023.8430 1049.0097 1062.1029 1066.5140 1072.6791 1086.1342 1113.6760 1127.7960 1138.8925 1171.0804 1173.2624 1176.5596 1190.5352 1193.2605 1213.7736 1243.4951 1256.8774 1262.2472 1271.1263 1303.0944 1310.2657 1319.7385 1361.3018 1377.2738 1379.8208 1382.9826 1431.0928 1438.5411 1446.0410 1451.5219 1467.9247 1470.9164 1481.4149 1483.6965 1508.4150 1567.4514 1577.2952 1593.9570 1597.9564 1608.6512 1610.5824 1615.0157 1624.0214 3010.5105 3017.9282 3068.8162 3119.7948 3121.5609 3129.3973 3130.2955 3141.1586 3143.9010 3155.6463 3160.1268 3163.2454 3168.2912 3181.0694 3184.5782 3198.7878 3518.8019
redmass: 6.8336 6.2398 6.7953 5.3906 4.6264 4.9681 2.9120 6.5629 5.7642 5.4611 5.6658 4.7520 4.7081 5.9871 5.4962 6.0213 6.8485 8.5473 4.2807 5.7559 8.2810 4.6513 2.8689 3.4077 3.0559 3.9635 3.3446 4.9386 4.8721 3.6892 5.8481 5.5063 5.6200 4.0466 6.3157 1.2694 6.4255 5.8392 7.3358 5.5263 1.6185 4.2731 3.8560 4.4257 1.4543 6.5129 2.4504 3.0710 7.8955 1.8129 2.4438 2.0940 1.4873 1.5765 4.9964 2.3245 2.2120 1.4454 1.4281 5.8903 1.3864 3.2560 1.4490 1.7135 2.1087 1.3450 2.5814 2.2716 3.2593 1.4863 2.8665 1.7156 2.1989 1.0515 1.3052 1.2740 1.0602 1.1897 1.1664 1.7381 1.9265 3.5290 2.1547 1.9291 2.1972 1.6044 1.5862 1.3311 1.4551 5.6025 3.6746 8.9036 2.2525 2.4803 4.1416 1.3770 1.6863 1.5740 2.2309 1.7528 2.3093 9.4872 6.1733 6.2785 7.6003 5.9636 4.7270 6.1618 8.6641 1.0591 1.0583 1.1002 1.1132 1.0864 1.0863 1.0886 1.0914 1.0920 1.0962 1.0894 1.0988 1.1000 1.0926 1.0959 1.0947 1.0763
irintensity: 2.2612 0.1470 2.5288 0.3650 0.8432 1.1136 10.7657 1.7571 4.9881 10.1906 1.1743 1.1981 0.4407 0.8598 0.8654 4.8571 2.2490 0.4195 0.8115 3.8350 6.7642 1.6446 0.1269 4.7642 2.4108 7.4847 5.0149 0.9824 2.6253 4.5859 13.2776 12.5170 7.9717 6.3990 1.0474 36.8517 9.5726 5.1546 3.4727 6.9978 82.2639 2.3429 7.2730 10.6200 80.5118 6.2148 31.3482 6.1940 28.0209 32.0761 5.4042 0.6469 9.5499 20.8234 0.9587 16.0830 2.2224 4.7824 3.4672 135.3433 2.0283 1.3406 1.0795 2.3187 11.0595 4.3358 12.0652 3.7380 80.2084 7.3709 10.2619 13.1847 8.4073 1.6507 1.3025 31.1272 0.7145 16.1768 7.6833 5.7937 20.6185 19.2834 279.2276 112.5766 52.6801 70.3502 149.8706 1.7392 6.3800 55.1867 8.5055 4.5938 19.8453 95.4830 55.9669 30.6506 17.4944 40.9470 19.4166 78.6196 281.2893 145.8538 55.7651 42.1796 15.8335 11.1399 60.2889 0.5593 22.9747 14.1014 86.3812 8.8483 28.8468 1.4903 1.4184 4.6579 19.5869 22.1533 14.4575 0.5859 34.0130 16.1044 2.1170 2.6954 4.4138 72.4453
temp: 298.150 k
press: 1.00000 atm
elementType: 8 8 8 8 7 6 6 6 6 6 6 6 6 6 6 6 6 6 6 6 6 6 6 6 6 6 6 1 1 1 1 1 1 1 1 1 1 1 1 1 1 1 1 1
symmnumber: 1
zpe: 881200.6 jmol-1
zpe.correction: 0.335632 hartree
zpe.thermalcorrener: 0.358069 hartree
zpe.thermalcorrenthalpy: 0.359014 hartree
zpe.thermalcorrgfe: 0.281177 hartree
zpe.sumelectzpe: -1202.305572 hartree
zpe.sumelectthermal: -1202.283134 hartree
zpe.sumelectthermalent: -1202.282190 hartree
zpe.sumelectthermalfe: -1202.360027 hartree
dipole: 5.5397 -1.0870 1.4929
dipole: 5.8394
quadrupole: -135.6393 -165.9840 -156.3902
quadrupole: 8.4087 -1.2509 -4.0013
quadrupole: 17.0319 -13.3128 -3.7191 8.4087 -1.2509 -4.0013
hfenergy: -1202.6412033 hartree
pointgroup: C01 [X(C22H17N1O4)]
dipole: 2.0949842 -0.7726829 -0.5403575 debye
polarizability: 304.4985617|-86.2457332|313.3981288|10.6922277|26.3716199|167.4490089 unknown
InChI: InChI=1S/C22H17NO4/c24-19(17-10-11-20-21(13-17)27-14-26-20)12-16-8-4-5-9-18(16)23-22(25)15-6-2-1-3-7-15/h1-11,13,23H,12,14H2
charge 0 multiplicity 1
44 atoms
O  3.504646 -0.866606 -1.758174
O  4.57053 -1.339274 0.33804
O  0.220439 3.275027 1.398589
O  -3.317808 -1.676654 -0.598911
N  -1.762459 0.053264 -0.236048
C  -0.568861 2.661862 -0.815936
C  -2.040508 2.490492 -0.444326
C  1.50476 1.521971 0.361259
C  0.392852 2.532445 0.388599
C  -2.615414 1.199644 -0.217962
C  2.930781 -0.090823 -0.724106
C  1.897594 0.835049 -0.834743
C  3.573073 -0.360881 0.505662
C  2.179651 1.259689 1.588621
C  -2.871374 3.629419 -0.347237
C  3.224827 0.311193 1.683606
C  -4.005578 1.080222 0.046814
C  4.436156 -1.801653 -1.077675
C  -4.249373 3.516181 -0.063006
C  -4.811611 2.23404 0.122244
C  -2.133564 -1.291578 -0.352995
C  -1.010121 -2.28461 -0.17786
C  -1.132056 -3.532571 -0.84262
C  0.107945 -2.053225 0.665364
C  -0.13939 -4.521876 -0.691858
C  1.096383 -3.050654 0.824956
C  0.979866 -4.283101 0.142232
H  -0.302448 1.966306 -1.630382
H  -0.431317 3.685863 -1.209377
H  1.437219 1.027439 -1.80616
H  1.857205 1.821371 2.47088
H  -2.42558 4.618744 -0.500027
H  3.736711 0.108823 2.627536
H  -4.439578 0.088047 0.177237
H  -0.75766 0.229918 -0.164507
H  5.421883 -1.748582 -1.56383
H  3.997439 -2.815581 -1.077428
H  -4.872954 4.413691 0.004304
H  -5.881621 2.125203 0.330595
H  -2.020016 -3.707135 -1.45884
H  0.196316 -1.122662 1.2389
H  -0.240706 -5.479877 -1.213337
H  1.941845 -2.872449 1.499019
H  1.741877 -5.059607 0.275289
