program: Gaussian 09
title: 000278188
version: EM64L-G09RevD.01
frameworkgroup: C1[X(C9H13N3O5S)]
method: RPBEPBE
basis: SDD
operation: Freq
keyword: #p
keyword: freq=noraman
keyword: PBEPBE/SDD
title: #p freq=noraman PBEPBE/SDD
converged: YES YES NO NO
title: Mulliken charges:
elementType: S O O O O O N N N C C C C C C C C C H H H H H H H H H H H H H
charge: 0.198753 -0.225405 -0.466407 -0.452276 -0.448555 -0.249323 -0.393877 -0.082579 -0.663859 -0.171870 -0.096717 -0.075033 -0.334779 -0.336556 -0.192516 0.410125 0.098311 -0.414701 0.250795 0.259736 0.252941 0.317913 0.230751 0.190961 0.372819 0.416170 0.371213 0.326248 0.245021 0.342713 0.319983
chargesum: 0.00000
title: Mulliken charges with hydrogens summed into heavy atoms:
elementType: S O O O O O N N N C C C C C C C C C
charge: 0.198753 -0.225405 -0.093588 -0.036106 -0.077342 -0.249323 -0.067629 -0.082579 -0.001163 0.078925 0.163020 0.177908 -0.016866 0.085156 -0.192516 0.410125 0.098311 -0.169680
polarizability: 2.23697985e+02 -5.03608442e-01 1.64431898e+02 8.77910699e+00 -8.31228499e+00 9.13008759e+01
1716.lowfreq: -6.5609 -4.0412 -0.0017 -0.0016 0.0004 2.9347 22.4214 38.3369 55.8749
frequency: 22.3746 38.3182 55.8715 64.7827 94.9001 119.8830 123.3358 142.9765 156.4919 174.9407 182.9121 202.7112 222.0733 240.6519 279.6907 318.4426 343.5567 351.3068 389.0937 402.1276 416.4809 447.8489 471.5397 491.8030 496.4510 517.6944 541.9441 551.5294 559.6809 579.4433 585.6393 635.4632 653.3933 694.0640 708.9154 756.9347 817.6583 840.2508 882.2634 908.5607 914.4518 954.9562 974.6758 980.1121 997.5958 1020.5163 1039.0645 1044.8329 1069.2679 1074.0240 1132.7968 1137.5749 1144.7571 1185.6496 1208.2151 1220.8309 1235.1432 1247.7417 1253.0856 1267.4551 1292.0591 1303.6887 1315.1585 1354.7333 1384.3256 1384.5757 1400.4300 1416.3335 1454.6013 1483.3036 1542.3666 1604.3635 1641.8831 1660.2327 2964.9102 2981.8170 2991.7705 3010.6915 3086.1578 3102.1928 3187.2041 3296.3990 3455.6974 3536.8046 3562.8588 3571.6699 3702.1679
redmass: 7.1640 6.8438 8.1573 7.8305 8.0480 3.7717 3.1637 4.7965 6.9480 4.2946 1.3441 5.1543 4.1792 4.5326 7.9105 4.4453 4.6808 6.7602 1.3568 3.3807 6.3376 1.1894 3.4973 2.1709 3.0504 1.8808 1.5277 3.1565 6.1574 7.1395 5.4637 7.3485 9.8163 4.4430 2.8140 1.2203 1.8001 7.3926 1.8376 5.1034 6.2140 5.0902 3.1711 5.9585 4.3348 5.9922 3.2558 1.7092 3.1409 1.9735 2.0387 2.5075 1.1744 1.3356 1.8215 1.2991 1.2861 1.2155 1.1515 2.7817 1.2348 1.3361 1.2495 1.3354 1.7383 1.9180 1.2392 1.5860 6.3695 1.0934 3.7101 5.0830 1.5399 3.3683 1.0694 1.0833 1.0850 1.0846 1.0964 1.0899 1.0930 1.0644 1.0672 1.0783 1.0463 1.0662 1.1041
irintensity: 2.3762 8.0005 4.0733 3.0945 2.3246 8.4281 3.0955 0.5195 0.1246 3.5154 46.3006 0.6493 1.8463 6.9211 3.5844 4.0846 1.9972 3.9798 48.9059 24.3525 33.4926 257.5860 20.5415 100.0022 77.7240 116.2002 91.4532 30.2307 23.8925 5.3406 2.4138 33.8984 2.9309 75.1865 39.1914 93.5396 81.0986 4.1607 15.8271 48.2574 110.7230 109.7697 2.8331 89.6832 43.4228 182.7721 52.3638 3.7445 120.3416 36.8336 8.8138 14.9704 3.1811 15.6912 242.0002 37.8421 28.6667 6.0577 8.6929 51.9089 23.8448 29.8404 36.7465 10.1889 2.7199 20.1818 41.8210 30.5188 150.4026 4.1379 476.4460 118.1120 89.4158 724.2742 47.7135 1.6599 12.8165 63.8305 29.0091 6.5448 6.1327 312.4470 47.7251 42.9809 107.4570 18.0602 37.0742
temp: 298.150 k
press: 1.00000 atm
elementType: 16 8 8 8 8 8 7 7 7 6 6 6 6 6 6 6 6 6 1 1 1 1 1 1 1 1 1 1 1 1 1
symmnumber: 1
zpe: 605759.9 jmol-1
zpe.correction: 0.230722 hartree
zpe.thermalcorrener: 0.249178 hartree
zpe.thermalcorrenthalpy: 0.250122 hartree
zpe.thermalcorrgfe: 0.183216 hartree
zpe.sumelectzpe: -1287.786794 hartree
zpe.sumelectthermal: -1287.768338 hartree
zpe.sumelectthermalent: -1287.767394 hartree
zpe.sumelectthermalfe: -1287.834300 hartree
dipole: 7.6799 -5.5445 1.9000
dipole: 9.6608
quadrupole: -93.7279 -118.2668 -115.6253
quadrupole: -33.4271 13.0605 1.9140
quadrupole: 15.4787 -9.0601 -6.4186 -33.4271 13.0605 1.9140
hfenergy: -1288.0175161 hartree
pointgroup: C01 [X(C9H13N3O5S1)]
dipole: -3.1949665 -1.3138716 -1.5850932 debye
polarizability: 212.985313|-16.9716873|164.0565781|31.6661291|13.5088871|102.3888685 unknown
InChI: InChI=1S/C9H13N3O5S/c10-4-1-5(14)12-9(11-4)18-8-7(16)6(15)3(2-13)17-8/h1,3,6-8,11,13,15-16H,2,10H2
charge 0 multiplicity 1
31 atoms
S  -0.433093 -1.889929 -0.3049
O  1.92219 -2.014703 1.147131
O  3.917061 0.494556 -0.611713
O  1.223303 1.450906 0.933639
O  5.518897 -1.895453 0.029129
O  -2.05669 2.896817 0.428017
N  -2.850452 -0.859748 -0.968744
N  -1.359186 0.690968 0.067207
N  -5.0281 -0.310541 -1.716543
C  3.04665 -0.075366 0.415488
C  1.543435 0.223249 0.251144
C  3.113816 -1.610813 0.330654
C  0.892222 -1.042239 0.898084
C  4.392156 -2.219935 0.910275
C  -1.624692 -0.513428 -0.383456
C  -3.853264 0.111154 -1.119476
C  -2.352012 1.751397 -0.023162
C  -3.614617 1.399721 -0.658177
H  3.351708 0.264119 1.42748
H  1.291862 0.266524 -0.828533
H  2.978324 -1.940168 -0.719346
H  0.331905 -0.828887 1.820113
H  4.330248 -3.319719 0.93849
H  4.554447 -1.842571 1.942012
H  3.861376 1.482222 -0.565237
H  0.242141 1.607842 0.769257
H  5.423362 -0.950772 -0.275462
H  -3.019321 -1.834309 -1.226804
H  -4.36971 2.180822 -0.769483
H  -5.795898 0.347856 -1.813476
H  -5.127969 -1.22687 -2.145709
