program: Gaussian 09
title: 000278196
version: EM64L-G09RevD.01
frameworkgroup: C1[X(C11H15N5O5)]
method: RPBEPBE
basis: SDD
operation: Freq
keyword: #p
keyword: freq=noraman
keyword: PBEPBE/SDD
title: #p freq=noraman PBEPBE/SDD
converged: NO YES NO NO
title: Mulliken charges:
elementType: O O O O O N N N N N C C C C C C C C C C C H H H H H H H H H H H H H H H
charge: -0.260579 -0.435914 -0.453576 -0.437342 -0.231963 -0.223583 -0.414040 -0.151276 -0.139274 -0.362525 -0.122382 -0.183057 -0.205655 -0.070699 -0.385066 0.234316 0.162898 0.165470 0.114184 -0.215275 -0.621711 0.260208 0.273249 0.302009 0.247882 0.203919 0.229333 0.375416 0.360910 0.358732 0.373372 0.253085 0.233868 0.259943 0.259978 0.245143
chargesum: 0.00000
title: Mulliken charges with hydrogens summed into heavy atoms:
elementType: O O O O O N N N N N C C C C C C C C C C C
charge: -0.260579 -0.060498 -0.092666 -0.063969 -0.231963 -0.223583 -0.055308 -0.151276 -0.139274 -0.117382 0.137826 0.090192 0.096354 0.177183 0.048186 0.234316 0.162898 0.165470 0.114184 0.037811 0.132078
polarizability: 2.36384803e+02 1.40672749e+01 1.85488522e+02 1.23986323e+01 -6.84432064e+00 1.08828033e+02
1716.lowfreq: -9.4056 -4.5325 -0.0004 0.0003 0.0005 4.6679 28.7537 47.0594 54.7129
frequency: 28.3487 47.0373 54.6537 88.4383 107.5115 111.2234 130.8504 149.0849 162.8309 192.4714 196.1005 206.1658 240.4295 243.6480 280.3120 295.8242 301.9066 329.1688 349.8400 390.4863 416.3721 435.7111 440.1915 490.2279 512.2619 554.4581 583.7024 589.1433 606.6123 609.0203 618.4018 634.8939 649.7550 692.6360 698.0970 710.2485 715.7111 731.2150 757.2540 767.1285 799.5255 800.9818 859.7187 861.7462 863.2270 900.6932 915.7468 951.6855 989.0526 1005.8104 1013.0441 1018.8691 1029.1959 1049.2233 1076.2717 1105.3645 1112.1000 1121.4224 1145.1427 1172.0857 1185.7895 1199.6764 1212.6636 1261.7710 1270.8903 1272.6424 1276.7609 1283.2200 1310.7078 1311.5516 1335.7275 1342.9421 1345.5960 1373.0082 1382.0120 1393.2484 1428.1971 1435.8733 1449.1683 1464.4711 1475.1590 1476.5838 1491.0822 1535.3178 1574.3532 1686.9279 1699.0496 2976.0520 2990.3004 3003.5526 3043.8015 3074.3758 3075.2536 3097.4056 3110.9516 3119.9882 3128.7748 3169.3556 3415.7438 3463.2664 3533.0629 3608.5080
redmass: 6.4741 6.4032 4.9709 4.9181 5.2420 3.8539 6.1961 4.6678 5.7377 1.4645 5.1733 2.9554 6.0166 7.0622 5.7349 5.0105 5.0756 3.1706 6.1412 5.2833 5.4956 6.6209 1.2189 5.9666 5.1861 4.6552 6.6949 3.6299 3.6374 4.2848 3.7546 1.4887 1.2831 4.4163 1.7790 2.9775 4.2844 4.5154 3.9824 3.3358 2.1111 2.3719 3.6285 1.4636 3.7404 5.0120 3.6611 3.3791 4.2203 3.0053 4.2472 2.1078 3.1083 2.8212 2.0247 2.0726 2.2067 1.3229 4.8378 1.2164 1.5970 4.3882 1.2547 1.2803 1.7842 1.7862 1.6291 1.9714 1.3695 2.8291 1.4343 1.4280 1.6042 1.2395 1.3523 1.1829 1.4376 1.2507 2.6319 1.0417 3.1226 1.0796 1.1211 6.1724 7.8294 8.2185 9.8799 1.0686 1.0350 1.0850 1.0859 1.0839 1.1026 1.0964 1.0759 1.0998 1.0887 1.0932 1.0771 1.0651 1.0656 1.0814
irintensity: 0.9759 3.3003 2.1509 0.6008 5.9742 8.1338 3.4367 0.7795 5.5600 0.4546 4.9505 2.7641 1.1927 4.7602 3.5431 1.2374 13.9714 2.3872 7.3755 13.8520 11.3146 5.0752 77.5136 28.3720 8.2833 6.6679 4.3215 8.7537 13.9685 15.2672 33.8375 91.1792 174.2487 11.8525 60.3569 55.9506 63.3345 18.6669 15.7438 22.0558 148.6790 93.9215 28.6157 27.0140 34.6293 56.2401 157.6664 270.3841 19.8969 99.6986 14.2658 33.0301 0.6732 31.4406 34.1685 118.1881 29.3385 0.4382 2.2075 21.6991 28.8363 5.6575 32.2047 6.4344 44.1349 2.7966 33.9870 82.3773 33.7414 55.5911 35.9224 22.1316 15.0347 22.4100 7.5065 48.9904 45.3609 40.5008 124.8046 18.5668 9.0089 6.4114 8.9887 120.5307 15.8944 570.6233 601.2098 38.1963 33.6281 23.0530 0.5219 231.5523 14.2506 24.9765 388.3233 5.9382 5.2387 2.2715 15.2692 33.9775 8.1027 114.0911
temp: 298.150 k
press: 1.00000 atm
elementType: 8 8 8 8 8 7 7 7 7 7 6 6 6 6 6 6 6 6 6 6 6 1 1 1 1 1 1 1 1 1 1 1 1 1 1 1
symmnumber: 1
zpe: 724907.5 jmol-1
zpe.correction: 0.276103 hartree
zpe.thermalcorrener: 0.295008 hartree
zpe.thermalcorrenthalpy: 0.295952 hartree
zpe.thermalcorrgfe: 0.228959 hartree
zpe.sumelectzpe: -1076.448483 hartree
zpe.sumelectthermal: -1076.429578 hartree
zpe.sumelectthermalent: -1076.428634 hartree
zpe.sumelectthermalfe: -1076.495627 hartree
dipole: -6.3330 -4.8184 -0.4247
dipole: 7.9689
quadrupole: -115.9448 -124.8320 -133.0293
quadrupole: 28.8564 -0.2806 -0.0507
quadrupole: 8.6572 -0.2299 -8.4273 28.8564 -0.2806 -0.0507
hfenergy: -1076.7245858 hartree
pointgroup: C01 [X(C11H15N5O5)]
dipole: -2.5710012 -1.7729922 0.2757655 debye
polarizability: 237.7725801|13.8335369|177.1842528|7.4578149|-23.4882916|115.7445239 unknown
InChI: InChI=1S/C11H15N5O5/c1-15-3-13-9-5(8(15)12)14-11(20)16(9)10-7(19)6(18)4(2-17)21-10/h3-4,6-7,10,12,14,17-19H,2H2,1H3
charge 0 multiplicity 1
36 atoms
O  1.919461 0.143831 -1.047914
O  1.109766 0.041929 2.299969
O  4.424002 0.297141 0.602554
O  4.678873 -2.287545 -0.555698
O  -0.129263 3.389297 -1.066109
N  -0.040952 1.189481 -0.075667
N  -2.044436 1.961494 -0.775349
N  -0.811162 -1.03882 0.750782
N  -3.17996 -1.387957 0.445461
N  -4.609182 0.38857 -0.57027
C  1.413861 1.095041 -0.02006
C  2.036265 0.633675 1.357217
C  3.140956 -0.37197 0.917017
C  2.53925 -1.02537 -0.341098
C  3.576688 -1.664164 -1.292032
C  -1.002975 0.200127 0.163913
C  -0.682813 2.327383 -0.69446
C  -2.236406 0.679079 -0.267755
C  -3.452987 -0.083754 -0.15886
C  -1.913764 -1.777801 0.863127
C  -4.326957 -2.299459 0.621256
H  1.767628 2.098644 -0.315604
H  2.485037 1.490122 1.883823
H  3.377647 -1.072648 1.728205
H  1.746134 -1.741284 -0.050325
H  3.936132 -0.882069 -1.992762
H  3.122526 -2.475778 -1.880696
H  0.515533 -0.63807 1.839674
H  4.288474 0.891859 -0.181223
H  -2.77741 2.552781 -1.164453
H  5.14772 -1.552483 -0.071136
H  -1.836881 -2.764895 1.326423
H  -3.9838 -3.23692 1.084555
H  -4.785594 -2.535185 -0.355678
H  -5.089476 -1.840276 1.275695
H  -5.430035 -0.230405 -0.454523
