program: Gaussian 09
title: 000278169
version: EM64L-G09RevD.01
frameworkgroup: C1[X(C10H14N2O3S)]
method: RPBEPBE
basis: SDD
operation: Freq
keyword: #p
keyword: freq=noraman
keyword: PBEPBE/SDD
title: #p freq=noraman PBEPBE/SDD
converged: YES YES NO NO
title: Mulliken charges:
elementType: S O O O N N C C C C C C C C C C H H H H H H H H H H H H H H
charge: 0.210149 -0.269210 -0.429436 -0.254359 -0.421967 -0.408863 -0.046031 -0.066722 -0.486855 -0.709973 -0.362780 0.180306 -0.437533 -0.074911 -0.338810 0.170720 0.243052 0.257486 0.278743 0.269552 0.258798 0.226253 0.224832 0.316853 0.322324 0.237113 0.212075 0.261504 0.260332 0.377359
chargesum: 0.00000
title: Mulliken charges with hydrogens summed into heavy atoms:
elementType: S O O O N N C C C C C C C C C C
charge: 0.210149 -0.269210 -0.052077 -0.254359 -0.105115 -0.086539 0.197021 0.190764 -0.208112 -0.181624 0.088305 0.180306 0.011656 0.186592 -0.078478 0.170720
polarizability: 2.16596027e+02 1.12615138e+01 1.23784681e+02 5.18362228e+00 -1.19631223e+01 1.10567839e+02
1716.lowfreq: -19.2508 -0.0019 -0.0019 -0.0015 3.4903 6.1452 25.8958 30.2245 36.1711
frequency: 25.8023 29.7761 36.0354 61.8360 74.0522 91.7221 133.3369 151.3891 161.9666 187.6290 209.5871 257.4741 329.0440 332.6390 341.5061 401.9052 427.4810 443.9516 472.8320 514.1580 540.9582 570.8339 589.5148 611.1148 629.3405 658.1999 685.8563 692.4011 706.1897 784.7907 804.9470 830.2099 868.1386 882.0208 908.7890 967.9269 970.3273 990.4303 1009.5352 1018.7272 1032.0963 1055.0873 1062.8330 1066.6908 1093.9557 1107.6515 1149.9689 1155.5328 1168.1357 1214.7633 1228.8615 1233.6679 1252.2669 1255.9765 1277.3924 1280.5305 1302.5615 1303.3632 1327.2816 1335.0624 1349.9064 1353.5324 1379.8073 1394.4198 1442.5300 1453.9802 1465.6881 1639.5566 1663.6564 1702.8392 2953.8562 2960.2520 2967.0302 2984.1780 3010.2729 3025.3237 3032.2108 3043.7458 3091.5665 3106.8745 3155.7593 3523.1323 3629.4590 3633.2845
redmass: 6.6663 5.5054 6.0562 5.8862 5.3998 4.1950 3.8330 3.8064 4.1069 3.6937 3.7468 5.1338 2.2056 1.8537 2.2558 4.1161 3.9722 1.0753 4.1287 3.9447 5.0418 4.8282 1.3689 3.7477 4.8095 3.7441 4.0078 4.0936 11.6270 1.4725 3.0734 3.8527 1.9688 2.0913 4.0225 4.3862 2.1452 1.5540 1.8424 2.3252 3.0422 1.9117 1.6957 2.1630 2.0295 1.7046 1.4837 1.2790 1.3854 1.4214 1.3129 1.3431 1.5906 2.0330 1.2177 1.3167 1.4350 1.3409 1.3319 1.5300 1.6065 1.7099 1.6814 2.1917 1.0994 1.0862 1.1008 8.6076 6.2342 7.3305 1.0615 1.0775 1.0671 1.0845 1.0967 1.0632 1.0919 1.0956 1.0906 1.1051 1.0927 1.0640 1.0782 1.0813
irintensity: 0.7475 3.4869 2.0188 0.3237 0.2069 3.3110 0.8270 0.5089 4.9195 1.9587 1.4500 2.9822 5.3381 1.2547 0.9339 21.3264 34.1375 281.8036 1.4054 11.9570 6.9146 11.9161 94.1391 14.4053 2.7410 10.4118 40.8681 26.4839 25.8807 16.0125 3.0414 14.0360 9.7198 5.5892 5.8286 2.4394 40.0417 17.3931 152.5198 85.0724 9.1674 151.5106 21.1565 54.0112 20.6726 27.9655 21.1329 6.0994 1.6753 18.4691 18.4902 5.5678 37.6367 96.8688 21.2960 7.2729 8.5174 2.5086 32.7325 32.3682 12.3719 36.1180 6.0863 110.0077 7.0513 5.5234 14.2102 282.5009 158.8607 638.1364 7.1144 19.0980 22.0968 65.9520 7.2367 41.1738 6.8611 43.4067 6.9542 10.4167 6.3418 44.0943 81.1797 11.1242
temp: 298.150 k
press: 1.00000 atm
elementType: 16 8 8 8 7 7 6 6 6 6 6 6 6 6 6 6 1 1 1 1 1 1 1 1 1 1 1 1 1 1
symmnumber: 1
zpe: 617697.3 jmol-1
zpe.correction: 0.235268 hartree
zpe.thermalcorrener: 0.251401 hartree
zpe.thermalcorrenthalpy: 0.252345 hartree
zpe.thermalcorrgfe: 0.188884 hartree
zpe.sumelectzpe: -1121.501173 hartree
zpe.sumelectthermal: -1121.485040 hartree
zpe.sumelectthermalent: -1121.484096 hartree
zpe.sumelectthermalfe: -1121.547557 hartree
dipole: -2.3672 0.4569 -1.9363
dipole: 3.0922
quadrupole: -136.5893 -98.3562 -104.0175
quadrupole: 20.1024 -13.9673 -2.7358
quadrupole: -23.6017 14.6315 8.9702 20.1024 -13.9673 -2.7358
hfenergy: -1121.7364412 hartree
pointgroup: C01 [X(C10H14N2O3S1)]
dipole: -0.9302369 -0.2970548 0.7255482 debye
polarizability: 216.1386258|-11.6080965|127.8665184|-8.1011597|-8.7164261|106.9434034 unknown
InChI: InChI=1S/C10H14N2O3S/c13-8(14)4-2-1-3-7-9-6(5-16-7)11-10(15)12-9/h2,4,6-7,9,11-13H,1,3,5H2
charge 0 multiplicity 1
30 atoms
S  1.463286 -1.135387 -1.562864
O  5.499842 1.1893 -0.161283
O  -6.348947 1.047668 -0.063887
O  -5.546986 -0.847445 1.025115
N  3.147449 1.324484 0.196299
N  4.153599 -0.628073 0.587136
C  2.034997 0.471059 0.615752
C  2.750324 -0.926993 0.883071
C  0.915186 0.315213 -0.45852
C  2.132906 -2.016461 -0.032237
C  -0.478275 0.093454 0.168984
C  4.393569 0.684888 0.163584
C  -1.611898 -0.006545 -0.884188
C  -2.949609 -0.277373 -0.250221
C  -4.068916 0.482304 -0.414733
C  -5.335225 0.12515 0.258309
H  1.572725 0.852164 1.54937
H  2.624666 -1.232369 1.940819
H  0.90078 1.20103 -1.119581
H  2.888317 -2.744986 -0.366841
H  1.312055 -2.55004 0.476554
H  -0.470744 -0.824631 0.790256
H  -0.69474 0.939013 0.854688
H  3.057814 2.306156 -0.050625
H  4.910997 -1.302884 0.64878
H  -1.350785 -0.839291 -1.571838
H  -1.648447 0.918599 -1.490999
H  -3.0277 -1.162905 0.400494
H  -4.080067 1.3785 -1.043634
H  -7.186674 0.779401 0.401941
