program: Gaussian 09
title: 000278160
version: EM64L-G09RevD.01
frameworkgroup: C1[X(C3H2N4O4)]
method: RPBEPBE
basis: SDD
operation: Freq
keyword: #pfreq=noraman
keyword: PBEPBE/SDD
title: #p freq=noraman PBEPBE/SDD
converged: NO NO NO NO
title: Mulliken charges:
elementType: O O O O N N N N C C C H H
charge: -0.397009 -0.179608 -0.147466 -0.162152 0.027395 -0.330138 0.037950 0.056929 0.053847 0.089895 0.171027 0.386441 0.392889
chargesum: 0.00000
title: Mulliken charges with hydrogens summed into heavy atoms:
elementType: O O O O N N N N C C C
charge: -0.004120 -0.179608 -0.147466 -0.162152 0.027395 0.056303 0.037950 0.056929 0.053847 0.089895 0.171027
polarizability: 9.55366049e+01 3.49056900e+00 9.25764457e+01 9.80209568e-03 -7.31348832e-03 2.96774008e+01
1716.lowfreq: -68.9461 -17.6443 -0.0014 -0.0013 -0.0008 8.7787 9.1139 13.9710 171.7679
frequency: -68.9241 -15.8295 171.7671 175.4058 225.2579 240.8506 356.4105 374.8270 485.3503 565.8919 567.9349 620.1886 652.7054 658.3910 705.1665 737.8546 752.9425 777.3833 932.1359 989.3217 1075.9974 1138.6164 1144.9564 1213.8959 1246.3739 1290.6644 1334.6504 1384.1547 1432.8604 1457.9588 1658.9041 3512.6054 3603.1729
redmass: 15.4596 11.3574 11.7672 11.3994 10.4139 6.7144 9.9678 11.8724 12.3052 8.2488 1.8349 5.1127 3.3896 5.0474 6.3195 1.2112 13.9119 12.1872 12.2796 6.0512 3.7682 5.4670 8.2813 6.8511 5.9714 3.0746 4.7378 12.3890 1.7990 5.7283 9.7191 1.0643 1.0843
irintensity: 0.2163 0.0077 0.3666 1.4678 2.1154 0.5192 4.8221 1.1101 2.5991 8.7500 71.9080 16.9639 34.6293 68.6237 66.2958 120.6225 41.2211 1.3132 7.2132 284.7175 43.8311 14.8125 12.7036 114.7241 9.7344 7.0530 47.4192 133.2797 45.2659 5.0967 195.9007 52.5175 152.3875
temp: 298.150 k
press: 1.00000 atm
elementType: 8 8 8 8 7 7 7 7 6 6 6 1 1
symmnumber: 1
zpe: 188319.7 jmol-1
zpe.correction: 0.071727 hartree
zpe.thermalcorrener: 0.079100 hartree
zpe.thermalcorrenthalpy: 0.080044 hartree
zpe.thermalcorrgfe: 0.039015 hartree
zpe.sumelectzpe: -634.474289 hartree
zpe.sumelectthermal: -634.466916 hartree
zpe.sumelectthermalent: -634.465972 hartree
zpe.sumelectthermalfe: -634.507002 hartree
dipole: -3.1680 4.4641 -0.0061
dipole: 5.4740
quadrupole: -66.2710 -58.3098 -59.0659
quadrupole: 6.7115 -0.0180 0.0069
quadrupole: -5.0555 2.9058 2.1497 6.7115 -0.0180 0.0069
hfenergy: -634.5460161 hartree
pointgroup: C01 [X(C3H2N4O4)]
dipole: 1.3180068 1.7032311 0.0023805 debye
dipolederiv: -1.273088 -0.1963164 0.000705 -0.222052 -0.2701056 0.000173 0.000879 0.0000773 -0.4101435 -0.6192222 0.1355833 0.000209 -0.1314072 -0.8261565 0.0005937 0.0002191 0.000393 -0.2898178 -0.4861682 -0.0434092 -0.0009457 0.1138454 -0.5957106 0.0016078 0.0012221 -0.0017696 -0.1822014 -0.7764778 0.0799638 0.001216 -0.047574 -0.4277598 -0.0007528 -0.0027794 0.0007827 -0.1999092 -0.1235691 -0.2187557 0.0001796 -0.2420782 0.0234228 -0.0003092 -0.0001167 -0.0000891 -0.1001618 -0.180046 -0.0067422 -0.0005838 -0.0133638 -0.3980029 -0.0002541 0.0000735 0.0000032 -0.1972551 -0.205929 0.2174567 -0.000062 0.2683933 0.0343297 0.0003254 0.0004996 0.0002462 -0.0734776 1.3760235 0.0946338 0.0004766 0.2036017 1.177586 -0.0000006 -0.0001903 -0.0005469 0.1942468 -0.0171289 0.0942731 0.000193 0.2389004 -0.2733469 0.0000388 0.00056 0.000557 0.0899581 -0.0070764 -0.1057411 -0.0005008 -0.24205 -0.1904443 -0.0006573 0.0008829 0.0007406 0.1342664 1.7438235 -0.0820041 -0.0009606 -0.0213963 1.2401132 -0.0008969 -0.0012815 -0.0005148 0.2703227 0.1928405 0.000393 0.0000541 0.0014741 0.3836771 0.0000531 0.0000708 0.0000131 0.3615347 0.376018 0.030665 0.0000196 0.0937065 0.1223979 0.000079 -0.000039 0.0001073 0.4026379 unknown
polarizability: 95.242892|-3.6010056|92.8701585|0.0100963|0.0069016|29.6774008 unknown
InChI: InChI=1S/C3H2N4O4/c8-3(9)1-2(7(10)11)5-6-4-1/h6,8H
charge 0 multiplicity 1
13 atoms
O  2.993373 -0.264715 -0.001165
O  1.474495 -2.024202 0.001033
O  -1.328401 -1.979356 -0.001973
O  -2.994393 -0.411668 -0.002779
N  1.118984 1.612734 -0.000575
N  -0.051933 2.316422 -0.000089
N  -1.210253 1.599298 0.00119
N  -1.756945 -0.767646 0.003177
C  0.691712 0.301261 0.000467
C  -0.748127 0.312383 0.001654
C  1.699644 -0.797858 0.000213
H  -0.060058 3.336441 -0.00065
H  3.642001 -1.020894 -0.001304
