program: Gaussian 09
title: 000278264
version: EM64L-G09RevD.01
frameworkgroup: C1[X(C25H27NO3)]
method: RPBEPBE
basis: SDD
operation: Freq
keyword: #p
keyword: freq=noraman
keyword: PBEPBE/SDD
title: #p freq=noraman PBEPBE/SDD
converged: YES YES NO NO
title: Mulliken charges:
elementType: O O O N C C C C C C C C C C C C C C C C C C C C C C C C C H H H H H H H H H H H H H H H H H H H H H H H H H H H
charge: -0.301833 -0.301264 -0.453782 -0.124623 -0.205470 0.374622 -0.466379 -0.572041 0.360282 -0.648750 -0.501874 -0.582101 -0.545656 0.450128 0.453284 0.191168 0.187841 0.134379 -0.380556 -0.361804 -0.459333 -0.405490 -0.264763 -0.234666 -0.222608 -0.215236 -0.248235 -0.530905 -0.530615 0.220025 0.258085 0.232578 0.223625 0.227655 0.263041 0.226053 0.220298 0.202518 0.255647 0.256157 0.228347 0.271248 0.230684 0.214169 0.224042 0.221702 0.222420 0.225625 0.224531 0.353895 0.227536 0.253635 0.220409 0.253519 0.221495 0.227339
chargesum: 0.00000
title: Mulliken charges with hydrogens summed into heavy atoms:
elementType: O O O N C C C C C C C C C C C C C C C C C C C C C C C C C
charge: -0.301833 -0.301264 -0.099887 -0.124623 0.014555 0.374622 0.024284 -0.120761 0.360282 -0.159657 -0.079058 -0.326454 -0.289499 0.450128 0.453284 0.191168 0.187841 0.134379 -0.152208 -0.090556 -0.228649 -0.191321 -0.040721 -0.012964 -0.000188 0.010389 -0.023704 0.170675 0.171738
polarizability: 3.85132097e+02 7.08585155e+00 2.51611268e+02 -1.27161310e+01 2.78680664e+01 2.17736768e+02
1716.lowfreq: -7.8710 -5.1642 -0.0007 -0.0007 -0.0003 6.3746 14.9983 23.8370 29.9587
frequency: 14.4840 23.7659 29.9572 33.1231 36.2062 46.0670 69.6464 74.9586 87.7035 103.7887 117.4685 135.3673 155.7946 156.9542 172.7087 176.2129 182.0383 199.8510 236.3630 247.9061 265.9494 276.4234 278.1746 314.4116 320.7639 335.5572 349.9529 377.9490 400.2868 404.4311 406.3980 423.1414 447.6783 457.1465 469.6434 495.2126 503.7466 519.2996 522.5531 560.9695 577.0953 597.6174 603.2088 616.5230 646.9366 658.6379 704.6853 707.9219 717.7713 721.5832 737.0985 744.2687 747.1944 749.9583 778.1269 806.5308 809.7275 836.3919 851.6962 859.4908 865.9298 886.3405 896.4802 906.2421 918.1236 928.0845 949.7947 956.0235 967.0465 968.4175 981.6297 986.0285 990.0168 998.8396 1002.0387 1026.5693 1031.4699 1038.6026 1067.6513 1076.2430 1079.2475 1111.1602 1113.4125 1115.4815 1121.4387 1147.3114 1149.9485 1151.4830 1162.7859 1168.7099 1169.5728 1175.7670 1179.9666 1182.1749 1195.7965 1207.4088 1214.3748 1224.8430 1236.0022 1239.5082 1265.4917 1267.4856 1274.5693 1299.6047 1305.5224 1320.5174 1326.7321 1341.5652 1347.4567 1363.0375 1375.6626 1384.6489 1391.5402 1394.9388 1422.9105 1437.5622 1439.1711 1443.2811 1451.1436 1457.5757 1459.2501 1463.0497 1471.5537 1478.3744 1482.5905 1484.6267 1485.3816 1488.6041 1495.0051 1565.9035 1593.9505 1602.8956 1612.8813 1613.4139 1616.3823 2867.9932 2960.3329 2968.0273 2970.2807 2978.3175 2990.4112 3005.3519 3009.4574 3022.5181 3064.2332 3066.3624 3073.2164 3080.3785 3105.3769 3110.5366 3112.4915 3118.0623 3118.6598 3120.3837 3126.4235 3133.6432 3135.9830 3139.5078 3145.0026 3159.2123 3163.2799 3584.1761
redmass: 5.5081 4.6338 4.3090 4.0702 4.7518 4.5337 3.7612 3.7193 4.6451 2.8900 3.9301 3.8160 2.1009 4.3287 1.1447 3.3770 1.6113 3.4629 3.4404 3.6222 2.7279 5.1202 4.4080 3.3672 1.2752 2.3850 3.4286 2.5461 5.1023 4.4088 2.9181 3.2405 3.6179 3.2795 3.1283 3.7719 4.5694 5.9728 3.7388 4.4383 4.0236 4.7088 4.9393 6.3014 4.1561 4.1808 2.3242 4.3428 3.3882 3.3240 3.3817 1.8814 4.0733 1.3640 2.8099 3.6237 4.4492 1.6689 2.7037 1.2489 2.1076 1.6850 1.5904 2.4459 1.5120 1.4793 3.8905 3.7943 1.3312 2.0792 1.3775 2.3878 4.2521 1.5542 2.9344 2.1046 2.7213 2.1707 3.1780 2.8375 1.6137 2.1131 1.2424 1.2423 2.1048 1.3676 1.5897 1.3266 1.4446 1.0586 1.0848 3.0611 1.1115 1.2382 1.3768 2.3891 1.9662 1.4381 1.4222 2.4822 2.3290 1.4950 1.9556 1.4371 1.5203 1.3445 1.2906 1.3340 1.5571 3.9272 2.2496 4.4983 2.6666 4.9170 1.1755 2.3573 2.0796 1.3243 1.1394 1.0552 1.0678 1.1029 1.2214 1.0555 2.0213 2.2126 1.2197 1.0596 2.4828 8.0894 6.1735 6.4448 7.1328 6.1256 6.7541 1.0702 1.0641 1.0309 1.0312 1.0844 1.0860 1.0640 1.0746 1.0814 1.1037 1.1037 1.1040 1.0973 1.0884 1.0866 1.0890 1.1027 1.1026 1.0863 1.0909 1.0916 1.0915 1.0913 1.0956 1.1014 1.1002 1.0659
irintensity: 0.0186 0.2087 0.3536 0.2514 0.1807 0.3532 1.4576 2.4710 2.2820 5.3167 1.7448 1.8280 2.9708 2.5331 0.1250 0.3655 4.7453 4.5109 5.5887 4.9457 8.1203 6.7029 3.1026 17.1142 114.2087 4.1437 4.2343 1.4631 1.5779 5.9806 0.6593 1.6018 8.4681 4.3812 14.4878 4.5410 18.0997 14.8658 5.3101 3.7690 4.9597 7.6159 1.1666 0.2153 15.2674 2.4471 26.6654 1.7837 14.1361 23.3975 9.6656 36.5108 9.1428 96.5165 7.1823 23.4130 8.8979 5.0598 6.5699 0.2662 1.4290 0.1730 10.7062 31.5519 8.1326 1.7417 51.7609 83.0817 0.2650 4.1952 0.2350 4.1338 0.4686 1.3717 7.7389 6.5563 30.2194 6.1274 96.2497 17.8154 18.5411 82.8818 17.0878 4.3155 39.3733 20.5503 6.5487 29.8561 12.1566 0.1224 2.2708 23.6512 1.6515 16.9411 5.5793 1.4960 4.0268 27.8897 13.4735 28.2124 91.9795 25.9877 55.6980 15.4960 1.4452 15.2828 8.7203 5.7825 28.7914 3.6616 13.9659 6.0476 3.9253 4.4493 0.4626 27.9400 12.9799 5.8066 10.4358 15.0986 7.9407 4.9776 2.7400 5.2139 66.4810 113.8065 27.7142 38.1269 29.3334 1.0523 0.3101 18.9725 5.2257 4.6754 0.7680 74.9775 31.2977 90.6957 72.0532 13.0577 25.4265 30.9196 6.4160 39.9151 31.4496 23.5727 25.1060 7.1808 17.8553 8.5023 8.8349 26.1280 30.3693 1.0610 9.1324 22.3114 5.0876 18.2350 25.7800 33.7903 28.4598 25.2579
temp: 298.150 k
press: 1.00000 atm
elementType: 8 8 8 7 6 6 6 6 6 6 6 6 6 6 6 6 6 6 6 6 6 6 6 6 6 6 6 6 6 1 1 1 1 1 1 1 1 1 1 1 1 1 1 1 1 1 1 1 1 1 1 1 1 1 1 1
symmnumber: 1
zpe: 1203708.7 jmol-1
zpe.correction: 0.458468 hartree
zpe.thermalcorrener: 0.485494 hartree
zpe.thermalcorrenthalpy: 0.486438 hartree
zpe.thermalcorrgfe: 0.398789 hartree
zpe.sumelectzpe: -1247.132519 hartree
zpe.sumelectthermal: -1247.105493 hartree
zpe.sumelectthermalent: -1247.104549 hartree
zpe.sumelectthermalfe: -1247.192198 hartree
dipole: -0.5077 -0.0642 0.6255
dipole: 0.8081
quadrupole: -149.4845 -171.8207 -159.4411
quadrupole: 3.8082 -9.0551 0.5444
quadrupole: 10.7643 -11.5719 0.8076 3.8082 -9.0551 0.5444
hfenergy: -1247.590987 hartree
pointgroup: C01 [X(C25H27N1O3)]
dipole: -0.1994097 -0.0224469 0.2466184 debye
polarizability: 385.333336|3.4576898|250.6235919|-12.5291012|28.6104477|218.5232048 unknown
InChI: InChI=1S/C25H27NO3/c1-28-24-15-19-12-13-26(17-18-8-4-3-5-9-18)22(21(19)16-25(24)29-2)14-20-10-6-7-11-23(20)27/h3-11,15-16,22,27H,12-14,17H2,1-2H3
charge 0 multiplicity 1
56 atoms
O  5.052131 -1.122727 -1.300826
O  5.700288 0.959549 0.662939
O  -2.124204 -1.942899 2.332904
N  -0.800371 0.435055 0.102139
C  0.195806 -0.574658 -0.328907
C  1.651736 -0.134016 -0.091453
C  -0.511949 0.950124 1.464345
C  0.857515 1.674235 1.550828
C  1.961768 0.901706 0.834636
C  -0.061091 -1.96361 0.356991
C  -1.079457 1.489281 -0.90195
C  2.702915 -0.77842 -0.787401
C  3.321043 1.228188 1.06644
C  -1.452251 -2.499776 0.080097
C  -2.399459 2.209999 -0.635997
C  4.050045 -0.430787 -0.575094
C  4.365545 0.567043 0.392799
C  -2.474684 -2.454376 1.064499
C  -1.790471 -3.039889 -1.183798
C  -3.553853 1.473197 -0.265277
C  -2.505302 3.612667 -0.798485
C  -3.78464 -2.915273 0.791874
C  -3.09256 -3.505588 -1.477083
C  -4.78919 2.127976 -0.069974
C  -3.742305 4.271659 -0.604541
C  -4.09457 -3.437967 -0.48309
C  -4.889257 3.530261 -0.240471
C  5.854985 -0.264622 -2.202899
C  6.545528 -0.109524 1.244173
H  0.049106 -0.729115 -1.417241
H  -0.540918 0.094041 2.16058
H  -1.327362 1.63364 1.759688
H  1.129899 1.836303 2.611883
H  0.774043 2.684699 1.099403
H  0.108398 -1.874904 1.442925
H  0.700239 -2.665814 -0.032691
H  -1.142254 0.983968 -1.886736
H  -0.262753 2.247025 -0.993357
H  2.489951 -1.558019 -1.529056
H  3.591127 2.006018 1.790263
H  -1.009961 -3.097129 -1.953656
H  -3.45763 0.390269 -0.125774
H  -1.616261 4.192624 -1.078349
H  -4.558254 -2.87013 1.570607
H  -3.321842 -3.917843 -2.465266
H  -5.675876 1.547484 0.211177
H  -3.809031 5.358287 -0.732855
H  -5.109435 -3.793632 -0.692029
H  -5.848744 4.038147 -0.088907
H  -2.908367 -1.944523 2.935451
H  6.60936 -0.931083 -2.648606
H  6.34145 0.552737 -1.64049
H  5.210762 0.159171 -2.996971
H  6.575629 -0.994049 0.582383
H  6.158508 -0.399941 2.239579
H  7.54873 0.332061 1.346631
