program: Gaussian 09
title: 000278161
version: EM64L-G09RevD.01
frameworkgroup: C1[X(C5H7N5)]
method: RPBEPBE
basis: SDD
operation: Freq
keyword: #p
keyword: freq=noraman
keyword: PBEPBE/SDD
title: #p freq=noraman PBEPBE/SDD
converged: YES YES NO NO
title: Mulliken charges:
elementType: N N N N N C C C C C H H H H H H H
charge: -0.100170 -0.273475 -0.126723 -0.153274 -0.632653 -0.007295 0.098145 -0.248981 0.112926 -0.619160 0.268800 0.318769 0.281395 0.243908 0.222857 0.317524 0.297407
chargesum: 0.00000
title: Mulliken charges with hydrogens summed into heavy atoms:
elementType: N N N N N C C C C C
charge: -0.100170 0.045295 -0.126723 -0.153274 -0.017722 -0.007295 0.098145 0.019819 0.112926 0.129000
polarizability: 1.30503756e+02 3.43557857e+00 9.62577391e+01 -1.59983620e+00 6.96685960e-01 4.37034445e+01
1716.lowfreq: -7.3296 -4.3556 -0.0006 -0.0003 -0.0003 10.3294 94.3490 146.7194 177.7266
frequency: 94.3469 146.7190 177.7242 197.1895 235.3462 239.4239 310.7650 375.6863 433.7132 467.9229 498.0524 546.6166 574.2280 600.0398 666.1362 691.4774 731.0076 804.1481 828.8890 884.8663 970.0452 1022.3120 1038.0131 1111.5324 1139.3096 1175.2485 1205.0188 1265.7090 1339.9581 1383.1710 1418.1768 1449.2170 1460.2773 1466.7128 1480.7160 1555.1621 1612.4221 1632.2860 2972.5654 3065.2830 3118.0098 3217.7159 3542.3905 3548.1359 3694.8705
redmass: 2.9953 1.0976 1.5460 3.9609 3.9018 2.1265 3.2255 4.2846 1.4000 1.3190 3.3926 4.0065 4.6177 9.2618 7.0891 6.9546 7.4166 7.7628 1.4205 7.3440 2.1093 5.8985 2.1636 1.3388 1.3319 5.3885 3.1581 2.0541 3.7209 4.1987 1.4254 1.5998 2.0560 1.1797 1.4779 4.8499 1.4582 4.0569 1.0376 1.0994 1.0993 1.0988 1.0808 1.0452 1.1028
irintensity: 22.3652 2.0871 69.4992 23.8173 9.0325 37.0833 14.5179 67.8317 293.0100 192.8247 7.6684 9.4980 2.1964 16.6883 6.3139 2.2677 7.2640 3.5385 31.1704 25.5193 7.2400 1.4196 4.6409 16.9276 42.2468 64.9862 36.7676 4.6225 4.0263 9.1833 0.4150 14.0028 152.8671 13.9789 10.6284 96.9494 36.3074 368.3774 79.5165 28.1226 5.2816 1.9344 55.0510 45.1923 24.4923
temp: 298.150 k
press: 1.00000 atm
elementType: 7 7 7 7 7 6 6 6 6 6 1 1 1 1 1 1 1
symmnumber: 1
zpe: 337278.5 jmol-1
zpe.correction: 0.128463 hartree
zpe.thermalcorrener: 0.137686 hartree
zpe.thermalcorrenthalpy: 0.138630 hartree
zpe.thermalcorrgfe: 0.094641 hartree
zpe.sumelectzpe: -467.657786 hartree
zpe.sumelectthermal: -467.648563 hartree
zpe.sumelectthermalent: -467.647618 hartree
zpe.sumelectthermalfe: -467.691607 hartree
dipole: 4.1471 7.3155 -0.3307
dipole: 8.4157
quadrupole: -38.6502 -59.0445 -62.0644
quadrupole: -5.3028 1.2089 -2.5375
quadrupole: 14.6029 -5.7915 -8.8114 -5.3028 1.2089 -2.5375
hfenergy: -467.7862481 hartree
pointgroup: C01[X(C5H7N5)]
dipole: -1.7158657 -2.8299618 -0.0995123 debye
dipolederiv: -0.883579 0.0000704 -0.0844494 0.3426887 -0.0998526 -0.0575728 -0.6291791 0.0072513 -0.2110137 -0.9923214 -0.4235593 0.2154883 -0.3298685 0.0410419 -0.0553025 0.6615243 0.1756354 -0.2022221 -0.7122219 -0.0321115 -0.001511 -0.6493273 -0.3223563 -0.008369 0.0164473 0.0134569 -0.237303 0.2016639 -0.1745216 0.037621 0.1690822 -0.4314446 0.0358846 0.0542747 -0.0395308 -0.3135607 -1.2435507 0.4171785 -0.0648348 0.5234606 -0.3967919 0.1625305 -0.2711622 0.23282 -0.6989041 -0.5859727 0.29023 -0.0112577 -0.6904976 -0.5816044 0.0039686 -0.0110547 0.0235913 0.0031168 0.4307674 0.0065838 0.0842429 0.8687148 0.5186544 0.0033389 0.0555103 -0.0433299 0.0301702 0.9312964 0.4232218 -0.092827 0.349269 0.1330271 -0.0229867 -0.0882251 -0.0722391 -0.0602443 1.5650516 -0.3517896 0.0986257 -0.2267028 0.3970103 -0.087333 0.1264894 -0.0639838 0.1200935 0.6410647 -0.1465416 -0.0759218 -0.290192 0.1137823 0.0878499 0.0522082 0.043211 0.3223872 0.0987326 -0.0046643 -0.002489 0.0012316 -0.0119684 0.0099456 0.0182284 0.017384 0.1926987 0.2513945 0.0090017 -0.0560824 0.034497 0.1916621 0.0021852 -0.2599524 -0.0893718 0.31607 0.1124196 -0.0516648 0.0317317 0.0198003 0.0036836 0.032768 0.0269875 0.039507 0.1097508 -0.0526566 0.0581932 0.0050414 0.0566827 0.0756227 0.0367536 0.1793937 -0.0384629 -0.1487388 -0.1331274 -0.0028412 -0.0585701 -0.1045539 0.0713996 -0.0668794 -0.0852734 -0.0585473 0.035366 0.2115465 -0.0046189 0.0040353 -0.0073445 0.14316 -0.0126749 0.065693 -0.0116808 0.3731489 0.1594924 -0.0121667 -0.0288431 -0.0669403 0.1549742 -0.0641065 0.0880902 -0.1357107 0.3691847 unknown
polarizability: 130.6437542|2.4481967|96.0454746|2.3136992|-1.5715597|43.7757113 unknown
InChI: InChI=1S/C5H7N5/c1-10-5-3(2-7-10)4(6)8-9-5/h2,7H,6H2,1H3
charge 0 multiplicity 1
17 atoms
N  -1.751813 0.051149 -0.24962
N  -1.70109 -1.355899 0.000289
N  0.212167 1.668277 -0.134345
N  1.637104 1.30358 -0.033988
N  3.00341 -0.671796 0.188189
C  0.455243 -0.677556 -0.049063
C  -0.419053 0.488657 -0.168813
C  -0.37383 -1.788868 0.034079
C  1.763983 -0.054502 0.029558
C  -2.917095 0.824719 0.192787
H  -0.170647 -2.855947 0.113679
H  -2.494191 -1.917812 -0.317475
H  -2.728915 1.869533 -0.100268
H  -3.05284 0.782278 1.291035
H  -3.835237 0.475476 -0.311553
H  3.818933 -0.062224 0.207868
H  3.134872 -1.640166 -0.088456
