program: Gaussian 09
title: 000278158
version: EM64L-G09RevD.01
frameworkgroup: C1[X(C8H6N4O2)]
method: RPBEPBE
basis: SDD
operation: Freq
keyword: #pfreq=noraman
keyword: PBEPBE/SDD
title: #p freq=noraman PBEPBE/SDD
converged: NO NO NO NO
title: Mulliken charges:
elementType: O O N N N N C C C C C C C C H H H H H H
charge: -0.207322 -0.207322 -0.215548 -0.035194 -0.035194 0.021528 0.473726 -0.345239 -0.345239 0.400468 -0.339120 -0.339120 -0.270134 -0.270134 0.292618 0.292618 0.290319 0.290320 0.273985 0.273985
chargesum: 0.00000
title: Mulliken charges with hydrogens summed into heavy atoms:
elementType: O O N N N N C C C C C C C C
charge: -0.207322 -0.207322 -0.215548 -0.035194 -0.035194 0.021528 0.473726 -0.052621 -0.052621 0.400468 -0.048801 -0.048801 0.003851 0.003851
polarizability: 2.37246046e+02 -6.50167694e-06 1.21624002e+02 4.01966553e-04 -1.34858473e-03 4.51711075e+01
1716.lowfreq: -6.1593 -4.3373 -0.0007 -0.0005 0.0006 22.4290 61.1124 62.7631 82.5631
frequency: 61.1066 62.7433 82.5281 128.2803 168.6542 246.5140 269.9331 317.8748 416.4930 445.5696 495.9219 502.7517 516.0499 622.3230 643.9856 651.1593 667.3944 696.6316 740.0442 788.4976 818.6023 853.6850 873.5186 879.3879 891.6709 942.2012 998.6086 999.0666 1005.0312 1045.9001 1051.6903 1067.6355 1090.6339 1117.0472 1172.6543 1194.1321 1212.0173 1237.5181 1293.8720 1360.1189 1363.6550 1379.7717 1401.9792 1423.1706 1439.1894 1492.9310 1603.2638 1610.7705 3178.8741 3179.1474 3194.4003 3197.3782 3244.7204 3266.6521
redmass: 9.7537 6.9304 5.3424 6.9700 6.7786 6.9550 11.5826 6.6844 2.9722 7.5042 7.6705 3.4560 6.0788 7.1361 3.3689 12.0210 4.7851 8.6419 4.6729 9.2325 1.1832 1.2410 1.4161 1.5989 5.6020 7.6325 3.5895 1.3322 1.3537 2.8208 4.4495 2.0038 3.1136 1.2798 1.3429 1.6724 5.3988 6.7885 1.2770 9.2721 4.1095 3.0961 6.3287 5.1422 4.0709 3.1375 8.5779 6.3284 1.0894 1.0892 1.0967 1.0977 1.0935 1.1065
irintensity: 0.0000 0.2299 0.0000 0.1709 9.9525 4.8709 0.5290 1.1882 0.0000 4.9509 13.7510 5.3457 0.0052 0.1455 0.0000 2.8004 25.8073 0.7882 3.2237 41.0966 60.0514 0.0000 0.0001 89.6632 89.2592 12.8674 1.4771 0.0348 0.0000 3.7000 13.7529 11.4518 32.8638 11.4258 87.0244 7.5805 453.3450 3.1929 0.0006 98.5766 0.1877 122.0566 8.0878 14.9976 22.0417 92.6639 2.7839 164.1981 1.1248 0.1156 1.2982 1.1299 0.0765 0.1652
temp: 298.150 k
press: 1.00000 atm
elementType: 8 8 7 7 7 7 6 6 6 6 6 6 6 6 1 1 1 1 1 1
symmnumber: 1
zpe: 362500.5 jmol-1
zpe.correction: 0.138069 hartree
zpe.thermalcorrener: 0.148736 hartree
zpe.thermalcorrenthalpy: 0.149680 hartree
zpe.thermalcorrgfe: 0.100379 hartree
zpe.sumelectzpe: -676.806275 hartree
zpe.sumelectthermal: -676.795608 hartree
zpe.sumelectthermalent: -676.794664 hartree
zpe.sumelectthermalfe: -676.843965 hartree
dipole: 6.3175 0.0000 0.0005
dipole: 6.3175
quadrupole: -86.9116 -77.9004 -81.4018
quadrupole: 0.0000 -0.0030 0.0017
quadrupole: -4.8404 4.1709 0.6695 0.0000 -0.0030 0.0017
hfenergy: -676.944344 hartree
pointgroup: C01 [X(C8H6N4O2)]
dipole: -2.4855029 -0.0000074 0.001222 debye
dipolederiv: -0.8335589 -0.2007302 0.0003365 -0.3255582 -0.6669873 0.0002598 0.0005386 0.0004002 -0.2300348 -0.833562 0.2007289 0.0001485 0.3255564 -0.6669832 0.0001344 0.0002102 0.0000133 -0.2300349 -1.2161498 -0.0000039 0.0004815 -0.0000048 0.0100736 -0.0000142 0.0004565 0.0000423 0.0146055 0.435323 0.082508 -0.0001904 0.5030016 -0.2874772 -0.000178 -0.00043 -0.0000188 -0.1398969 0.4353264 -0.0825033 -0.000257 -0.5029959 -0.2874804 0.0002123 0.0000048 0.0000412 -0.1398973 2.1837147 0.0000038 -0.0008687 0.0000044 1.0883927 -0.0003887 -0.0009438 -0.0004168 0.1910198 1.5407755 0.0000044 -0.0005695 0.0000051 0.1484303 -0.0000787 -0.0005563 -0.0000645 0.0885697 -0.4645441 -0.1307248 0.0002017 -0.3338371 -0.0331234 0.0000661 0.0002786 -0.0000003 -0.1367128 -0.4645467 0.1307221 0.000066 0.3338337 -0.0331199 -0.0001982 -0.0000374 -0.0000921 -0.1367126 -1.0021405 -0.0000034 0.0004757 -0.0000028 0.0227215 0.0000097 0.0004191 0.0000032 0.0551683 0.3275204 0.1000668 -0.0002168 -0.1930084 -0.00463 0.0000258 -0.0001551 -0.0000967 -0.100844 0.3275189 -0.1000644 -0.0001209 0.1930102 -0.0046296 -0.0001532 -0.0003173 -0.0000051 -0.100844 -0.4764515 0.0527905 0.0001613 0.6923645 0.1599496 -0.0002664 0.0000452 -0.0000698 -0.0955658 -0.4764463 -0.0527945 0.0001437 -0.6923689 0.1599444 0.0002736 0.0002343 -0.0000294 -0.0955659 0.1007514 0.0521816 -0.0000064 0.054679 0.0538634 0.0000554 0. 0.000048 0.1688192 0.1007522 -0.0521813 0.0000662 -0.0546787 0.0538626 0.0000956 0.0000919 0.0000791 0.1688191 0.0992466 -0.0542959 0.0000577 -0.018352 0.0669676 0.0000699 0.0000522 0.0000829 0.1699801 0.0992461 0.054296 -0.0000076 0.0183521 0.0669683 0.0000599 0.0000052 0.0000316 0.1699802 0.0586125 -0.0391786 0.0000511 -0.0649707 0.076628 0.0000317 0.0001471 0.0000406 0.1895735 0.058612 0.0391784 0.0000475 0.0649705 0.0766288 -0.0000169 -0.0000439 0.000011 0.1895736 unknown
polarizability: 237.2460137|0.0003537|121.6239881|-0.0789069|-0.0321963|45.1711534 unknown
InChI: InChI=1S/C8H6N4O2/c13-12(14)8-3-1-7(2-4-8)11-9-5-6-10-11/h1-6H
charge 0 multiplicity 1
20 atoms
O  4.183702 1.142116 -0.002535
O  4.18371 -1.142087 -0.001468
N  -2.110336 -0.000006 0.000743
N  -2.853449 -1.171059 0.00127
N  -2.853457 1.171043 0.000766
N  3.577717 0.000013 -0.001455
C  -0.688022 -0.000001 0.000199
C  0.005083 1.236718 -0.000803
C  0.005092 -1.236716 0.000662
C  2.092236 0.000008 -0.000882
C  1.4100 1.236076 -0.001345
C  1.410009 -1.236065 0.000107
C  -4.13832 -0.714549 0.001474
C  -4.138325 0.714524 0.001527
H  -0.563169 2.169538 -0.00113
H  -0.563154 -2.16954 0.001429
H  1.981717 2.167432 -0.002116
H  1.981732 -2.167417 0.000431
H  -4.970777 -1.412738 0.001815
H  -4.970786 1.412708 0.001811
