program: Gaussian 09
title: 000278157
version: EM64L-G09RevD.01
frameworkgroup: C1[X(C7H9N5)]
method: RPBEPBE
basis: SDD
operation: Freq
keyword: #p
keyword: freq=noraman
keyword: PBEPBE/SDD
title: #p freq=noraman PBEPBE/SDD
converged: YES YES NO NO
title: Mulliken charges:
elementType: N N N N N C C C C C C C H H H H H H H H H
charge: -0.170853 -0.080532 -0.017826 -0.391268 -0.511575 0.104403 0.057294 0.071062 -0.269732 -0.617348 -0.192066 -0.329762 0.238100 0.259189 0.238518 0.239108 0.226709 0.315872 0.237473 0.294867 0.298367
chargesum: 0.00000
title: Mulliken charges with hydrogens summed into heavy atoms:
elementType: N N N N N C C C C C C C
charge: -0.170853 -0.080532 -0.017826 -0.075397 0.081660 0.104403 0.057294 0.071062 -0.031631 0.119467 0.034643 -0.092289
polarizability: 1.53148023e+02 -9.86545084e+00 1.26762060e+02 -7.20230566e-01 -4.20717284e-01 5.36858257e+01
1716.lowfreq: -7.1928 -5.8509 -0.0008 -0.0003 0.0009 3.1202 82.8967 105.0290 121.6862
frequency: 82.8955 105.0281 121.6776 144.8013 162.0037 179.5799 232.0142 233.3302 340.7492 353.4955 425.0553 477.2598 526.7246 539.9946 555.6478 606.4628 653.4557 679.6403 745.6150 774.7795 782.8488 801.7700 854.6578 930.3641 965.2830 984.5172 1014.4347 1033.5245 1126.3161 1127.6773 1153.8483 1208.7677 1220.3873 1267.0691 1286.9641 1315.6231 1363.9881 1378.1613 1412.0926 1436.0175 1451.1355 1465.9665 1474.1485 1497.3939 1545.9736 1557.4184 1599.3839 1685.0636 2991.9311 3076.9398 3118.3593 3131.7891 3136.6496 3173.4849 3369.7929 3485.7818 3588.8426
redmass: 4.2571 1.4502 1.3162 2.0428 2.0057 5.1461 5.0318 3.2818 3.7373 5.5908 3.8351 1.2301 5.7946 5.1951 4.1214 6.3654 6.0684 4.5777 6.9694 2.0401 1.8591 2.3674 4.7152 1.3894 1.3642 3.5332 4.2810 2.5869 1.4563 1.2974 2.9931 2.3680 3.5651 2.5614 1.1748 2.4082 2.3032 4.5677 1.8325 1.6567 1.6319 1.0436 1.5451 1.8402 5.9365 6.9615 7.1496 1.0621 1.0336 1.1023 1.1004 1.0882 1.0925 1.0981 1.0433 1.0979 1.0788
irintensity: 4.8624 2.7905 8.4728 7.2378 1.3940 2.2803 1.0805 3.3105 21.4012 19.4013 7.7755 170.5869 7.1187 5.9584 5.5243 16.6709 0.7586 15.3620 8.9576 47.2815 121.7584 24.9018 51.1204 0.0246 0.7591 14.2079 11.3596 0.7196 3.5916 0.7812 11.3538 16.2073 33.3299 18.9200 0.8725 16.7083 22.9419 44.6335 48.6837 12.6010 12.3219 15.4392 6.0381 101.0965 16.8897 173.1766 124.2865 34.7480 69.6410 25.9483 4.1616 4.6537 21.6403 23.6602 2.3226 0.4239 49.3728
temp: 298.150 k
press: 1.00000 atm
elementType: 7 7 7 7 7 6 6 6 6 6 6 6 1 1 1 1 1 1 1 1 1
symmnumber: 1
zpe: 430383.9 jmol-1
zpe.correction: 0.163925 hartree
zpe.thermalcorrener: 0.174890 hartree
zpe.thermalcorrenthalpy: 0.175834 hartree
zpe.thermalcorrgfe: 0.127267 hartree
zpe.sumelectzpe: -544.980624 hartree
zpe.sumelectthermal: -544.969658 hartree
zpe.sumelectthermalent: -544.968714 hartree
zpe.sumelectthermalfe: -545.017281 hartree
dipole: 0.0390 -1.0398 -0.1666
dipole: 1.0538
quadrupole: -71.2634 -59.7587 -71.7066
quadrupole: -5.8871 -0.1060 0.4054
quadrupole: -3.6872 7.8176 -4.1304 -5.8871 -0.1060 0.4054
hfenergy: -545.1445484 hartree
pointgroup: C01 [X(C7H9N5)]
dipole: -0.0385544 -0.401931 0.0941567 debye
dipolederiv: -0.5516388 0.1369335 -0.0219611 -0.36975 -0.6120587 0.0249498 -0.0016998 0.0325221 -0.1551508 -0.0446226 -0.5243497 0.0351304 0.1031588 -0.3153164 0.0010575 -0.0008947 -0.00143 -0.2117283 -0.4584756 -0.2625146 0.0122899 0.004091 -0.4562778 0.0172885 -0.0058812 0.0093881 -0.2188364 -0.6701238 0.4051124 -0.0249546 0.7431816 -0.4384473 -0.0711004 0.0691473 -0.1901774 -0.4324217 -0.1808389 0.1850341 -0.0272107 0.411925 -0.3384975 0.0957989 -0.1322998 0.0960375 -0.039249 -0.3589122 0.4354575 -0.0384224 -0.4605154 -0.3835571 0.0220914 0.0300031 0.0370244 0.0254107 0.2921606 0.3615426 -0.0235252 0.7493346 0.5262135 -0.0094292 -0.0484706 -0.0208011 0.0872277 1.0351719 -0.6753361 0.0546822 -0.8111929 0.455735 -0.0134428 0.0726252 -0.0081526 0.0848702 0.4739194 -0.0957512 0.0211128 0.2327639 0.1566798 -0.0118742 -0.0016101 -0.019257 -0.1083407 0.0284131 0.004681 -0.0061269 0.0862327 0.65392 -0.0305032 -0.0113349 -0.029438 0.2298994 -0.4231461 0.1797902 -0.0173066 0.2342642 -0.2073693 0.0100534 -0.0237972 0.0101813 -0.1707306 0.3429248 0.0658566 0.0074457 -0.2218271 0.4710414 -0.0439341 0.028274 -0.0360843 -0.0841693 0.0678539 0.0879788 -0.0086301 0.0468942 -0.0692121 0.016384 -0.0040508 0.0159067 0.145758 -0.0200874 0.0886547 -0.0089488 -0.0005271 0.0966932 0.0030333 -0.0026667 0.0048644 0.129524 0.0803487 -0.0984063 -0.0823676 -0.0441509 -0.0659604 -0.040344 -0.0734576 -0.1280944 -0.0488199 0.0731206 -0.0884503 0.1012632 -0.0339534 -0.0435735 0.0376806 0.0853094 0.1241159 -0.0675678 -0.0036707 -0.1001071 0.0013112 -0.1110232 -0.0300615 0.0105799 0.0014499 0.0105907 0.1773371 0.0674069 -0.0695023 0.0022445 -0.132262 0.2016572 0.0386625 -0.0465128 0.1122465 0.3280656 -0.1386219 -0.0018274 -0.0077577 0.0204304 0.0843765 0.0036212 -0.00932 0.002827 0.1299637 0.1751285 0.0088265 0.0693905 -0.2022637 0.114304 -0.166463 0.0741801 -0.0929402 0.1430147 0.2136895 -0.0436231 -0.0376586 -0.2448106 0.199711 0.1058899 0.0010072 0.0706702 0.0559435 unknown
polarizability: 154.0109416|8.6312975|125.5409344|2.2312907|-4.5574544|54.0440333 unknown
InChI: InChI=1S/C7H9N5/c1-12-7-5(3-2-4-9-7)6(10-8)11-12/h2-4,10H,8H2,1H3
charge 0 multiplicity 1
21 atoms
N  0.260306 1.444973 -0.085922
N  1.53615 0.838554 -0.004319
N  -2.089642 0.751454 -0.103464
N  2.343221 -1.414867 0.158851
N  3.695266 -1.001208 0.26283
C  -0.124372 -0.789246 0.061335
C  -0.750039 0.507325 -0.047028
C  1.294775 -0.503472 0.081773
C  -0.970179 -1.92159 0.111331
C  0.144146 2.892115 -0.200553
C  -2.362164 -1.695799 0.055207
C  -2.867153 -0.363471 -0.049336
H  -0.573774 -2.940451 0.186672
H  -0.928825 3.137921 -0.240162
H  0.605889 3.388907 0.670553
H  0.639953 3.250256 -1.119779
H  -3.068184 -2.530568 0.088696
H  2.160405 -2.380775 0.422014
H  -3.948467 -0.189735 -0.09312
H  3.81259 -0.301555 1.012977
H  4.022001 -0.617467 -0.635155
