program: Gaussian 09
title: 000278150
version: EM64L-G09RevD.01
frameworkgroup: C1[X(C2H2N4O2)]
method: RPBEPBE
basis: SDD
operation: Freq
keyword: #pfreq=noraman
keyword: PBEPBE/SDD
title: #p freq=noraman PBEPBE/SDD
converged: NO YES YES YES
title: Mulliken charges:
elementType: O O N N N N C C H H
charge: -0.200663 -0.164595 0.035432 -0.324506 0.074032 0.004795 0.163331 -0.278578 0.306189 0.384562
chargesum: 0.00000
title: Mulliken charges with hydrogens summed into heavy atoms:
elementType: O O N N N N C C
charge: -0.200663 -0.164595 0.035432 0.060056 0.074032 0.004795 0.163331 0.027612
polarizability: 7.53001431e+01 5.14260741e-01 6.44597193e+01 -5.86047958e-04 -3.25602287e-05 2.22961938e+01
1716.lowfreq: -9.1352 -0.0007 0.0004 0.0006 5.9700 7.1466 61.9237 213.0160 214.3944
frequency: 61.9199 213.0157 214.3927 415.5514 506.2353 609.3873 633.2106 706.5462 726.1807 749.3271 868.0261 915.0019 961.1165 1044.3535 1142.5483 1152.4577 1211.1316 1288.2754 1334.9546 1374.0708 1415.8767 1450.7158 3277.5583 3610.8883
redmass: 8.4999 8.6605 8.4845 11.8685 9.6537 7.6278 5.9624 1.2118 5.8570 14.4163 1.3926 6.0091 5.1757 5.0320 3.0711 2.5750 10.4316 7.1793 3.5476 5.1070 6.1156 2.0261 1.1008 1.0844
irintensity: 0.0224 0.7442 0.9947 0.8063 0.1446 0.5893 8.2329 125.5339 11.1304 39.1800 40.6482 10.2124 30.5749 5.9196 7.8365 33.4973 78.3691 47.5399 46.2486 76.2744 68.1491 14.9623 8.8867 139.5511
temp: 298.150 k
press: 1.00000 atm
elementType: 8 8 7 7 7 7 6 6 1 1
symmnumber: 1
zpe: 154813.2 jmol-1
zpe.correction: 0.058965 hartree
zpe.thermalcorrener: 0.065091 hartree
zpe.thermalcorrenthalpy: 0.066035 hartree
zpe.thermalcorrgfe: 0.027903 hartree
zpe.sumelectzpe: -446.141704 hartree
zpe.sumelectthermal: -446.135578 hartree
zpe.sumelectthermalent: -446.134633 hartree
zpe.sumelectthermalfe: -446.172766 hartree
dipole: -4.3621 0.0705 0.0003
dipole: 4.3627
quadrupole: -47.9710 -46.2921 -43.9642
quadrupole: 6.3209 0.0000 0.0002
quadrupole: -1.8953 -0.2163 2.1115 6.3209 0.0000 0.0002
hfenergy: -446.2006689 hartree
pointgroup: C01 [X(C2H2N4O2)]
dipole: 1.7152344 0.0632261 -0.0000497 debye
dipolederiv: -0.5660679 -0.1500573 0.0000822 -0.0739058 -0.6889764 0.0001586 0.0000789 0.0001268 -0.2300783 -0.5939201 0.2088355 -0.0000168 0.1110019 -0.6213212 0.0000888 -0.0000168 0.0001384 -0.2000451 0.2469585 0.2428146 -0.0000988 0.2106601 -0.2797863 0.0000511 -0.0000347 0.0001301 -0.0557739 -0.4422225 -0.2242955 0.00014 -0.1144129 0.0067095 -0.0000938 -0.0000906 -0.0001945 -0.2338997 1.5171765 -0.0302454 -0.0001064 0.0042901 1.1641316 -0.0002558 -0.0001792 -0.0002871 0.2133275 -0.2762438 0.0204274 -0.000037 0.0830736 -0.0378379 -0.0000068 0.0000052 -0.0000125 -0.1357349 -0.3961883 -0.0310414 0.0000157 -0.2021388 -0.0281482 0.0000285 0.0001665 0.0000566 0.1022188 0.0697193 -0.0892051 0.0000241 -0.0927648 0.1145926 -0.0000651 0.0000407 -0.00007 -0.0363178 0.134444 -0.0067875 0.0000135 -0.0176328 0.1095359 0.000044 0.0000147 0.0000363 0.2030244 0.3063442 0.0595546 -0.0000165 0.0918292 0.2611004 0.0000506 0.0000155 0.0000757 0.373279 unknown
polarizability: 75.2152951|1.0849179|64.5445608|-0.0043752|-0.0162269|22.2962003 unknown
InChI: InChI=1S/C2H2N4O2/c7-6(8)2-1-3-5-4-2/h1,5H
charge 0 multiplicity 1
10 atoms
O  -1.99102 -1.242898 0.000475
O  -2.143421 1.045145 -0.000205
N  0.659502 1.190696 -0.000745
N  1.95058 0.757651 -0.000472
N  -1.478533 -0.053824 0.000142
N  2.156211 -0.609437 -0.000034
C  -0.023206 0.002939 -0.000046
C  0.879162 -1.098412 0.000347
H  0.673013 -2.163563 0.000832
H  2.73101 1.413903 -0.000794
