program: Gaussian 09
title: 000278162
version: EM64L-G09RevD.01
frameworkgroup: C1[X(C10H9N5)]
method: RPBEPBE
basis: SDD
operation: Freq
keyword: #pfreq=noraman
keyword: PBEPBE/SDD
title: #p freq=noraman PBEPBE/SDD
converged: YES YES NO NO
title: Mulliken charges:
elementType: N N N N N C C C C C C C C C C H H H H H H H H H
charge: -0.176004 -0.272141 -0.152048 -0.150487 -0.638433 0.077622 -0.028207 0.488051 -0.245728 0.127590 -0.360096 -0.420602 -0.226501 -0.205166 -0.254593 0.325884 0.270180 0.322942 0.200133 0.233191 0.227649 0.232130 0.302953 0.321677
chargesum: 0.00000
title: Mulliken charges with hydrogens summed into heavy atoms:
elementType: N N N N N C C C C C C C C C C
charge: -0.176004 0.053744 -0.152048 -0.150487 -0.013802 0.077622 -0.028207 0.488051 0.024453 0.127590 -0.037154 -0.220469 0.006690 0.022483 -0.022463
polarizability: 2.70555406e+02 6.40526935e-02 1.50328082e+02 7.89267166e-01 -7.93493690e-01 5.65270172e+01
1716.lowfreq: -1.8597 0.0007 0.0008 0.0009 9.2512 10.7804 45.3440 57.3853 113.0492
frequency: 45.3143 57.2702 113.0418 146.2187 173.7672 225.3791 242.0648 263.8813 285.7248 306.0431 379.2033 391.8789 407.2908 452.9648 486.1652 512.1262 577.9476 603.0317 610.0706 627.3675 679.1603 689.3334 692.9669 726.6259 751.9534 797.4100 821.6015 822.9824 887.9489 903.4473 959.1605 967.7329 980.0928 1002.1795 1024.6990 1030.6325 1049.1653 1069.0250 1102.2739 1174.3380 1183.8581 1204.5804 1246.0245 1293.0003 1335.0463 1349.0706 1380.9057 1393.0491 1445.3919 1453.5230 1468.9216 1502.7179 1535.4374 1590.4486 1609.0006 1614.0559 1634.9216 3119.7329 3127.5095 3140.3995 3151.5275 3170.6031 3225.1465 3560.0545 3584.1064 3709.5771
redmass: 4.3409 4.8262 5.2850 1.3123 3.9178 7.4189 2.4358 3.7926 1.9453 3.5886 3.9872 4.8152 2.8275 1.3672 3.3564 3.5007 4.3011 8.6308 6.4189 6.2715 7.8717 2.0025 6.3724 6.9949 1.7806 8.1911 1.3998 1.2939 7.2646 1.3750 6.5858 1.3494 5.9172 1.3119 2.5689 2.0978 2.7484 2.8534 1.5875 1.2232 1.8960 1.1991 2.2766 3.5477 1.5555 2.2976 4.7173 5.1681 2.9480 2.2083 3.9859 3.1913 5.5039 6.3672 1.9489 2.7832 4.3935 1.0873 1.0915 1.0901 1.0956 1.1011 1.0989 1.0449 1.0819 1.1034
irintensity: 0.8957 12.4221 1.5671 134.0948 4.4419 9.2864 98.4148 3.2299 108.8246 38.7189 53.8878 8.2755 9.7177 109.7263 8.7031 7.4384 1.6080 12.9134 0.5215 0.6731 13.6765 42.4466 1.7996 8.3808 81.9552 38.6465 33.8676 0.6404 29.1719 9.2445 2.0937 0.5944 2.8324 2.2525 2.9576 4.7189 22.9368 25.8328 5.0365 7.9087 43.7509 9.5808 36.5564 161.6561 9.9644 14.5912 6.5199 35.6334 89.6598 2.7661 104.9523 212.0949 83.4728 27.3202 67.9448 299.6702 308.4161 16.5432 6.5405 5.1194 20.8919 28.9907 4.2611 103.7582 55.5853 28.5988
temp: 298.150 k
press: 1.00000 atm
elementType: 7 7 7 7 7 6 6 6 6 6 6 6 6 6 6 1 1 1 1 1 1 1 1 1
symmnumber: 1
zpe: 472932.2 jmol-1
zpe.correction: 0.180130 hartree
zpe.thermalcorrener: 0.192566 hartree
zpe.thermalcorrenthalpy: 0.193510 hartree
zpe.thermalcorrgfe: 0.141184 hartree
zpe.sumelectzpe: -659.088102 hartree
zpe.sumelectthermal: -659.075667 hartree
zpe.sumelectthermalent: -659.074723 hartree
zpe.sumelectthermalfe: -659.127049 hartree
dipole: -1.0239 7.8674 0.0885
dipole: 7.9342
quadrupole: -65.7212 -79.3736 -93.3111
quadrupole: 12.4140 -2.3456 0.4907
quadrupole: 13.7474 0.0951 -13.8425 12.4140 -2.3456 0.4907
hfenergy: -659.2682325 hartree
pointgroup: C01 [X(C10H9N5)]
dipole: -0.4071319 -3.0904482 -0.1660939 debye
dipolederiv: -1.7419939 -0.0514768 -0.0316484 0.4249303 -0.0598962 -0.0280251 -0.0647402 -0.0324831 0.0088615 -0.5467798 -0.6629476 0.0412328 -0.830306 -0.2569798 0.0446912 0.2335803 0.2214404 -0.1980245 -0.3013867 -0.0627238 -0.0017184 -0.7982293 -0.4651644 -0.0226417 -0.0753449 -0.0056517 -0.2267466 0.042453 -0.0081705 -0.0009358 0.5076448 -0.3476227 0.000671 0.0172856 -0.0169483 -0.3076619 -1.8203346 0.1431175 0.0391407 0.2692359 -0.1910673 -0.0613446 0.2399943 -0.0850714 -0.7004892 0.3050921 -0.1223563 0.0025201 0.7410645 0.6000503 0.0467146 0.0040351 0.0117633 0.0155712 -0.5945381 0.2989766 0.0290153 -0.8352175 -0.6199481 -0.0310629 -0.0371211 -0.0625607 -0.0135874 1.7694705 -0.1096222 -0.0283363 -0.5616255 0.0504443 -0.0030942 -0.0398496 0.012981 0.0882428 0.5545921 0.5547721 -0.0035007 0.7439931 0.3869494 0.0129648 0.012101 -0.038649 -0.0608698 2.0005927 -0.0396017 0.0088031 0.0965378 0.3392138 0.0443301 0.012166 0.0778353 0.1331166 -0.3744586 0.0228191 0.0010683 0.4632533 -0.098911 -0.0050961 0.0253592 0.0051662 -0.1531138 -0.424134 0.054709 0.0081284 -0.2417251 -0.0021466 -0.0162568 0.0077993 -0.0344003 -0.222009 0.2573633 0.001676 -0.0056287 -0.0674093 0.1942968 -0.0053333 -0.0139154 -0.0026701 -0.1352255 0.1507459 -0.0066943 -0.0082625 0.1033555 0.1166166 -0.0110825 -0.0152357 -0.0153064 -0.1388928 -0.1775723 -0.0472983 -0.0034386 -0.0886901 -0.1530804 0.0027466 0.0022688 0.0031447 -0.1848674 0.2189 -0.0324684 -0.0382261 0.0305791 0.2589257 -0.0138672 -0.1503521 -0.1146732 0.3156291 0.1002995 0.0161307 0.0007958 0.0222167 0.0103412 -0.0153958 0.0141876 -0.0037439 0.1954366 0.1418447 -0.0506657 0.0074005 -0.0322638 0.0998001 0.0030588 0.0180606 -0.0028506 0.1759708 0.0778744 0.1014354 0.0016809 0.0720688 -0.1094729 0.0098268 0.0014936 0.0165225 0.1717806 0.0619668 0.0372023 0.0007083 0.0770125 -0.0911668 0.0035806 -0.0022557 0.00191 0.1536059 -0.0427461 -0.0946122 0.0070772 -0.125633 -0.0136918 0.0083242 0.010147 0.0080755 0.1573972 -0.1215348 0.0563298 0.0046747 0.0585664 0.0758469 0.0010433 0.0053928 0.0004529 0.1713905 0.2156978 -0.0196248 -0.0108772 -0.0874983 0.12626 0.0361823 -0.1385326 0.0729299 0.3814881 0.248586 0.021094 -0.0196735 0.0581393 0.1504028 -0.0009341 -0.0665241 -0.0172129 0.3729969 unknown
polarizability: 270.5542306|-0.2727852|150.2334531|0.8719684|3.0888055|56.6228216 unknown
InChI: InChI=1S/C10H9N5/c11-9-8-6-12-15(10(8)14-13-9)7-4-2-1-3-5-7/h1-6,12H,11H2
charge 0 multiplicity 1
24 atoms
N  -0.121293 -0.570353 -0.052162
N  0.348356 -1.905452 -0.089908
N  1.291874 1.554485 0.11804
N  2.757283 1.614052 0.174231
N  4.644324 0.118927 0.10137
C  1.020506 0.242281 0.021693
C  2.198195 -0.618406 0.004462
C  -1.490201 -0.221197 -0.001506
C  1.740532 -1.926668 -0.094973
C  3.27426 0.350605 0.110349
C  -1.813821 1.164068 -0.01502
C  -2.5154 -1.201685 0.053942
C  -3.167959 1.549073 0.009898
C  -3.865269 -0.790958 0.073041
C  -4.201303 0.581945 0.047656
H  -0.279669 -2.640004 -0.413779
H  2.250998 -2.885443 -0.164908
H  -1.005981 1.90457 -0.037011
H  -2.288345 -2.272796 0.112854
H  -3.415968 2.615893 0.000208
H  -4.654783 -1.549061 0.11801
H  -5.250797 0.8930 0.065028
H  5.022669 -0.801668 0.297741
H  5.255795 0.92869 0.176844
