program: Gaussian 09
title: 000278156
version: EM64L-G09RevD.01
frameworkgroup: C1[X(C12H9N3)]
method: RPBEPBE
basis: SDD
operation: Freq
keyword: #pfreq=noraman
keyword: PBEPBE/SDD
title: #p freq=noraman PBEPBE/SDD
converged: NO YES NO NO
title: Mulliken charges:
elementType: N N N C C C C C C C C C C C C H H H H H H H H H
charge: -0.256113 0.000884 -0.033073 0.029344 0.226440 0.402491 -0.428333 -0.280371 -0.351685 -0.397077 -0.177167 -0.226664 -0.203147 -0.336995 -0.247922 0.271108 0.254178 0.312144 0.284670 0.231845 0.225530 0.227384 0.244433 0.228096
chargesum: 0.00000
title: Mulliken charges with hydrogens summed into heavy atoms:
elementType: N N N C C C C C C C C C C C C
charge: -0.256113 0.000884 -0.033073 0.029344 0.226440 0.402491 -0.157225 -0.026193 -0.039541 -0.112407 0.054678 -0.001135 0.024237 -0.092562 -0.019825
polarizability: 2.37888742e+02 -3.15141307e+00 1.60559219e+02 -6.13611720e-02 8.60141545e-02 5.61758484e+01
1716.lowfreq: -7.3953 -2.0346 -0.0006 -0.0005 -0.0003 12.6235 45.1009 78.9864 137.3703
frequency: 45.0217 78.9858 137.3660 193.4261 223.4271 294.8689 311.2211 347.4739 410.7232 434.2063 494.0957 508.5350 575.9694 585.8030 615.4805 620.5763 634.6915 702.9385 703.4436 747.2165 770.4625 779.7751 793.4428 840.9010 860.7878 896.4660 935.6696 941.0375 967.7925 978.6538 987.4591 993.0004 1005.9112 1017.1225 1029.1575 1044.4168 1094.7608 1111.5058 1170.5793 1174.7259 1192.2072 1208.8507 1264.0433 1302.0417 1327.3449 1345.9655 1378.5391 1385.9613 1395.8382 1413.4574 1449.4484 1464.1830 1492.1099 1545.6473 1596.3343 1603.0387 1615.1405 3129.8958 3137.2140 3141.4126 3149.9846 3161.0950 3175.2652 3176.3509 3188.6060 3218.0363
redmass: 4.1769 5.1311 5.1724 4.6329 5.5839 5.6218 4.6436 6.3202 2.9909 4.2030 5.2445 3.2624 7.7256 3.3293 6.4758 7.3798 6.1073 2.1357 6.2015 8.1865 1.6594 3.0535 1.2344 1.7097 1.2482 5.7252 1.4090 1.4034 6.4826 1.3656 6.2214 1.3444 1.2994 3.6398 2.1348 2.7025 1.6001 1.7088 1.2224 1.4704 1.2250 1.5365 2.9074 2.3275 1.3500 3.0641 4.1192 7.8369 6.1470 3.0436 2.4446 2.8322 2.6485 6.4498 6.8469 7.1572 6.0734 1.0853 1.0889 1.0907 1.0914 1.0965 1.0970 1.0991 1.0953 1.0976
irintensity: 0.2714 4.0668 2.2752 0.2899 0.4639 0.5206 1.0351 4.7917 0.0056 0.2238 1.7640 4.6740 1.1555 2.1921 0.6156 7.2854 15.3046 37.8447 9.7556 14.2078 44.6586 52.8664 19.9589 45.8481 0.1048 23.0759 0.0001 10.8961 28.1232 0.9138 0.9264 0.2683 2.8595 1.8831 10.8466 8.7628 15.7662 3.8275 3.9704 6.4942 8.3906 9.9553 5.1098 0.4725 5.6721 46.9680 31.4540 0.0213 113.4991 38.4577 13.3643 5.6980 170.0056 11.8739 3.6869 40.2488 43.1065 0.0109 9.8417 24.7919 9.8855 22.4264 32.9131 15.4272 4.3970 2.0974
temp: 298.150 k
press: 1.00000 atm
elementType: 7 7 7 6 6 6 6 6 6 6 6 6 6 6 6 1 1 1 1 1 1 1 1 1
symmnumber: 1
zpe: 481599.3 jmol-1
zpe.correction: 0.183431 hartree
zpe.thermalcorrener: 0.194016 hartree
zpe.thermalcorrenthalpy: 0.194960 hartree
zpe.thermalcorrgfe: 0.146399 hartree
zpe.sumelectzpe: -625.898782 hartree
zpe.sumelectthermal: -625.888198 hartree
zpe.sumelectthermalent: -625.887254 hartree
zpe.sumelectthermalfe: -625.935815 hartree
dipole: 2.4675 -0.1673 0.0007
dipole: 2.4732
quadrupole: -65.1439 -80.2272 -92.3795
quadrupole: 1.5009 -0.0254 0.0560
quadrupole: 14.1063 -0.9770 -13.1293 1.5009 -0.0254 0.0560
hfenergy: -626.0822138 hartree
pointgroup: C01 [X(C12H9N3)]
dipole: 0.9699508 0.0764263 -0.0122416 debye
dipolederiv: -1.0302561 -0.0671667 0.0115448 0.350632 -0.4725025 0.0350286 -0.0230499 0.0369785 -0.0272061 -0.0456037 -0.3438741 0.0289594 -0.6999848 0.1070022 -0.01966 0.0546634 -0.0202228 -0.1726208 -0.6422138 -0.0016461 0.0027296 -0.2943628 -0.2851412 0.0100148 0.0304103 0.0091102 -0.1841227 0.9561376 0.3723579 -0.0373583 0.3547675 0.0112689 0.0033244 -0.0331985 0.0026569 0.07543 -0.3937291 -0.1281249 0.0137435 0.5941009 -0.1765265 0.0163322 -0.0485673 0.0205232 0.0533515 1.2679101 -0.1804133 0.0084417 -0.3782774 0.0952024 0.0008068 0.0259487 -0.0007911 0.0643322 -0.4533672 0.2561302 -0.0194967 -0.0718687 0.3611554 -0.0410298 0.0081245 -0.0428587 -0.1222654 0.2304478 0.100743 -0.0109703 -0.0857067 0.307549 -0.0352477 0.0050037 -0.0361407 -0.1049123 -0.2557277 0.0423869 -0.0025681 0.1744925 -0.1160455 -0.0031405 -0.013934 -0.0034815 -0.1511078 -0.2948045 -0.0152799 0.0023392 -0.0855643 0.0016746 -0.0118744 0.0073028 -0.0129958 -0.1617391 -0.1076552 0.1833524 -0.0160809 0.1032502 -0.3803243 0.0198552 -0.0090755 0.0193742 -0.1449157 0.0115287 -0.0411529 0.0029665 -0.1021789 0.1564322 -0.0223367 0.0068467 -0.0232643 -0.1543088 0.1049601 0.0816914 -0.0072041 0.1347662 0.0697204 -0.0165603 -0.0106261 -0.0167824 -0.1530388 0.4375952 -0.2087765 0.0148744 0.0676254 0.3814763 -0.0404581 -0.0095851 -0.0387273 -0.0817032 -0.0385525 -0.0415345 0.0027578 -0.0281502 -0.076542 -0.0071808 0.0017706 -0.0066423 -0.1702215 0.0568726 0.0406863 -0.0028935 0.0243021 -0.0097296 0.0154281 -0.0008453 0.0151238 0.1721449 -0.0223732 0.0661467 -0.004596 0.1030122 0.0309634 0.0096404 -0.0076991 0.0098839 0.1503961 0.206091 -0.0519868 0.0025297 -0.0625076 0.0732543 0.0070719 0.0025064 0.0075737 0.1668227 0.1659646 0.0433336 -0.0032196 0.0319526 0.0048618 0.0117501 -0.0017026 0.0122168 0.170855 -0.0879185 -0.0795187 0.0084546 -0.0810362 0.0643605 0.0097405 0.0084585 0.0096642 0.1712298 0.0559914 0.0375412 -0.0023277 0.0782608 -0.1098541 0.0190107 -0.0053148 0.0195327 0.1533583 -0.0513602 -0.0980372 0.0078829 -0.1206967 -0.0139018 0.0127201 0.0096524 0.0127447 0.1542139 0.0646564 -0.0276146 0.0028833 -0.0724594 -0.1000938 0.0204657 0.0068969 0.0201034 0.1307956 -0.1345937 0.0607569 -0.0033922 0.065631 0.0757398 0.0062989 -0.0039867 0.0064208 0.1652321 unknown
polarizability: 237.7987421|3.9602358|159.965419|-1.3403604|-8.3896003|56.8596485 unknown
InChI: InChI=1S/C12H9N3/c1-2-6-11(7-3-1)15-12-10(9-14-15)5-4-8-13-12/h1-9H
charge 0 multiplicity 1
24 atoms
N  -0.019669 -0.595808 0.068061
N  0.260281 -1.972885 0.181751
N  1.30947 1.491292 -0.11674
C  1.16841 0.141232 -0.000269
C  2.248628 -0.811719 0.074185
C  -1.3897 -0.168917 0.040017
C  1.607676 -2.091979 0.18605
C  3.574609 -0.315961 0.023241
C  -1.712833 1.208314 -0.059691
C  -2.414178 -1.14629 0.114205
C  3.740056 1.077234 -0.097394
C  -3.069636 1.59536 -0.083365
C  -3.762684 -0.738189 0.088839
C  2.596898 1.928172 -0.162951
C  -4.100642 0.631993 -0.00958
H  2.051716 -3.082786 0.267827
H  4.437622 -0.987472 0.075256
H  -0.909905 1.946668 -0.117676
H  -2.139868 -2.200492 0.190633
H  4.737473 1.524046 -0.141984
H  -3.317799 2.659745 -0.160732
H  -4.552193 -1.495543 0.146721
H  2.723244 3.012477 -0.257019
H  -5.150777 0.942507 -0.028886
