program: Gaussian 09
title: 000278271
version: EM64L-G09RevD.01
frameworkgroup: C1[X(C25H25NO2)]
method: RPBEPBE
basis: SDD
operation: Freq
keyword: #p
keyword: freq=noraman
keyword: PBEPBE/SDD
title: #p freq=noraman PBEPBE/SDD
converged: YES YES NO NO
title: Mulliken charges:
elementType: O O N C C C C C C C C C C C C C C C C C C C C C C C C C H H H H H H H H H H H H H H H H H H H H H H H H H
charge: -0.318125 -0.301734 -0.162774 -0.144336 0.046926 -0.665947 -0.400478 0.419094 -0.572833 0.139195 0.380564 0.122203 -0.493243 0.009425 -0.622028 0.220555 -0.462038 -0.362845 0.447313 -0.244251 -0.264249 -0.378144 -0.452120 -0.526446 -0.226532 -0.222479 -0.526912 -0.247212 0.211233 0.222351 0.244566 0.239048 0.198762 0.238287 0.214315 0.219279 0.204919 0.260264 0.236388 0.288824 0.225529 0.225985 0.264282 0.231725 0.254727 0.225560 0.228510 0.224130 0.224170 0.254161 0.226495 0.219122 0.226820
chargesum: 0.00000
title: Mulliken charges with hydrogens summed into heavy atoms:
elementType: O O N C C C C C C C C C C C C C C C C C C C C C C C C C
charge: -0.318125 -0.301734 -0.162774 0.066897 0.046926 -0.199030 0.037332 0.419094 -0.120231 0.139195 0.380564 0.122203 -0.069046 0.009425 -0.361764 0.220555 -0.225650 -0.074020 0.447313 -0.018722 -0.038264 -0.113861 -0.220395 0.182351 -0.002402 0.001691 0.172866 -0.020393
polarizability: 3.72942796e+02 -8.95493127e+00 3.06999171e+02 3.09689073e+00 -9.13824352e+00 1.83765423e+02
1716.lowfreq: -9.7778 -3.3098 -2.3019 -0.0013 -0.0008 -0.0006 20.4211 26.7318 33.6108
frequency: 19.7757 26.6828 33.5226 51.9131 57.1202 75.9864 92.3465 94.4635 115.4647 132.8795 159.0287 159.3996 166.7853 184.0235 204.5068 216.9011 224.0317 245.3570 264.3645 278.8152 297.4425 328.3000 344.9487 357.7623 368.4477 381.0159 406.0616 417.9458 437.1253 442.2393 451.0280 466.8367 508.0779 521.1100 536.7970 542.3037 584.7925 612.3483 616.8590 618.7384 640.5871 666.5962 684.4369 703.7278 709.3196 739.7989 743.0462 757.9360 774.1295 789.4464 796.4819 808.1943 832.1070 860.1477 861.6778 881.7480 888.9825 901.4434 916.1791 934.7252 954.3708 960.0968 974.2481 981.3527 983.9003 989.9501 990.7232 1000.0095 1018.9965 1024.6859 1034.8502 1044.0845 1070.0457 1074.9900 1081.3990 1092.8212 1110.5445 1111.7402 1122.3502 1139.8926 1150.7311 1154.9259 1159.4420 1162.4031 1169.3587 1176.4250 1179.7497 1185.6223 1206.2682 1209.2594 1219.8070 1221.1312 1248.5772 1260.6511 1273.6686 1291.3364 1299.6750 1312.1957 1313.9718 1325.5343 1342.7782 1355.8326 1366.3005 1374.8882 1380.5597 1391.7564 1401.9039 1412.1944 1431.6536 1440.3119 1441.0568 1445.3524 1454.1705 1455.2803 1457.3126 1459.8930 1464.6555 1476.6106 1477.2217 1482.3888 1485.5038 1487.8953 1577.0962 1577.6194 1593.9856 1597.1910 1612.1008 1614.5455 2794.2278 2849.1706 2858.3017 2970.8415 2974.0478 2978.4387 2979.1006 3021.1358 3036.0507 3046.7142 3054.5071 3070.0223 3073.8606 3110.9344 3116.3886 3117.7687 3118.9997 3122.2790 3131.3256 3135.1969 3145.3421 3146.7357 3153.9495 3160.8940 3192.1512
redmass: 4.3745 4.7701 3.9339 3.9755 3.4330 3.5566 2.7671 4.1189 3.6386 3.1453 1.3531 1.4926 1.8276 2.9018 4.6311 3.3047 3.5265 3.0322 4.0123 3.3855 4.0781 5.3331 3.8079 2.8478 4.1141 5.1337 2.8639 5.1101 4.9139 3.2168 3.2631 3.1605 4.0135 3.3832 4.4317 4.2970 4.5800 4.2675 6.1987 5.0875 5.9838 4.6233 5.0191 2.8035 2.4968 2.2905 1.9296 1.6376 3.9966 4.5499 3.3585 3.7903 2.5649 3.0503 1.3133 1.5799 1.5209 3.9181 1.4517 3.4191 1.5372 2.5608 2.2168 3.1565 1.5343 5.8364 1.3266 1.3876 2.0189 2.1930 2.5183 2.3749 2.7291 2.7488 1.8181 2.9506 1.2382 1.2424 2.0390 2.5668 1.3839 1.6231 1.4054 1.7981 1.0634 1.1081 1.1155 1.3103 1.7110 2.4220 1.8377 2.3557 1.4406 1.4741 1.5269 2.0157 1.5100 1.6017 1.6058 1.6868 1.9773 2.0033 3.3134 3.0039 2.8293 2.3371 2.6077 1.6118 1.6953 1.4989 2.0875 1.2337 1.1548 1.8093 1.0761 1.1904 1.1633 1.0948 1.0632 2.1378 1.0569 2.6766 7.1642 7.8513 6.1961 7.3660 6.5609 6.1112 1.0786 1.0726 1.0710 1.0313 1.0299 1.0636 1.0613 1.0846 1.0992 1.0888 1.0960 1.1027 1.1049 1.0870 1.0866 1.1030 1.1031 1.0861 1.0902 1.0914 1.0919 1.0953 1.0983 1.1013 1.0940
irintensity: 0.0572 0.1050 0.1367 0.1682 2.4639 1.6709 6.8318 0.2519 1.8087 3.9162 0.7327 0.0245 0.3834 3.3327 0.4238 2.2992 3.5583 1.7449 8.5747 3.5536 9.1104 4.9798 0.9161 3.3035 1.2612 1.4579 0.3770 1.4774 1.5277 0.9728 3.1913 9.9644 0.3258 8.5504 0.7347 10.3408 1.1982 2.3459 0.7233 10.3143 9.2444 2.0256 5.7886 13.0178 19.4099 22.3130 34.8197 52.0277 24.8157 3.1151 18.1641 9.7008 11.3837 7.1039 0.2856 0.9889 14.6160 15.2710 1.4853 46.1984 5.5527 33.6599 45.7092 43.6276 5.9410 0.1424 0.4760 1.3025 1.8438 12.1170 6.2271 11.6231 27.9462 41.9443 1.3119 19.5525 10.7579 2.1103 44.6931 8.3001 2.4575 9.0518 2.8802 4.7079 0.7273 1.7935 3.2715 7.1591 35.4878 0.2995 2.4983 29.7579 16.6867 8.4293 6.2201 61.0942 16.6001 1.4971 29.3944 26.2811 26.8363 2.8468 2.7789 15.0041 10.0284 4.7546 16.6495 21.1274 56.3761 28.5747 7.5343 8.2469 9.9221 14.6266 15.0055 1.8793 13.2928 4.2831 2.6904 17.5702 27.3915 25.0080 6.6713 6.8912 1.4903 22.8198 2.6152 10.3101 42.7407 22.4599 145.2974 94.4379 57.4434 17.9951 32.0099 12.5313 29.5650 36.3056 41.3511 26.2138 24.1381 8.9032 6.1446 20.5675 27.7245 0.1360 20.0186 19.9738 5.2941 32.7768 42.2016 31.6983 7.3114
temp: 298.150 k
press: 1.00000 atm
elementType: 8 8 7 6 6 6 6 6 6 6 6 6 6 6 6 6 6 6 6 6 6 6 6 6 6 6 6 6 1 1 1 1 1 1 1 1 1 1 1 1 1 1 1 1 1 1 1 1 1 1 1 1 1
symmnumber: 1
zpe: 1140235.5 jmol-1
zpe.correction: 0.434293 hartree
zpe.thermalcorrener: 0.458657 hartree
zpe.thermalcorrenthalpy: 0.459602 hartree
zpe.thermalcorrgfe: 0.379281 hartree
zpe.sumelectzpe: -1170.836010 hartree
zpe.sumelectthermal: -1170.811645 hartree
zpe.sumelectthermalent: -1170.810701 hartree
zpe.sumelectthermalfe: -1170.891022 hartree
dipole: -0.1967 -0.0872 -0.6199
dipole: 0.6561
quadrupole: -147.0037 -159.4071 -160.6487
quadrupole: 0.3410 -1.9193 2.1678
quadrupole: 8.6828 -3.7206 -4.9622 0.3410 -1.9193 2.1678
hfenergy: -1171.270303 hartree
pointgroup: C01[X(C25H25N1O2)]
dipole: -0.0784175 0.0616196 0.2381006 debye
polarizability: 374.0578733|3.3524999|303.5233794|-0.8535318|-19.2161374|186.1261373 unknown
InChI: InChI=1S/C25H25NO2/c1-27-22-15-19-12-13-26(16-17-8-4-3-5-9-17)21-14-18-10-6-7-11-20(18)24(23(19)21)25(22)28-2/h3-11,15,21H,12-14,16H2,1-2H3
charge 0 multiplicity 1
53 atoms
O  -4.327205 0.583792 -0.347962
O  -3.718522 3.351301 -0.628046
N  1.879416 0.135222 0.320797
C  0.510042 -0.422781 0.491197
C  -0.598381 0.592492 0.181946
C  0.264674 -1.652305 -0.41837
C  2.002466 1.516139 0.852432
C  -0.316627 1.965586 -0.012954
C  1.114792 2.469453 0.046086
C  -1.941782 0.093967 0.08091
C  -1.083605 -2.255666 -0.067202
C  -2.175039 -1.374295 0.215421
C  2.92614 -0.743812 0.900548
C  -2.985504 1.022365 -0.203069
C  -1.376322 2.868946 -0.259298
C  -2.700572 2.410472 -0.338625
C  -1.263733 -3.653502 0.018055
C  -3.418247 -1.939499 0.614471
C  4.321807 -0.454462 0.353233
C  -2.510545 -4.203742 0.39174
C  -3.584082 -3.338188 0.701024
C  4.504205 -0.091654 -1.005168
C  5.461489 -0.597271 1.182338
C  -4.837759 0.665876 -1.737678
C  5.801022 0.116446 -1.524357
C  6.761386 -0.394166 0.664339
C  -4.746329 3.504287 0.427266
C  6.935733 -0.03732 -0.692636
H  0.362666 -0.761224 1.554091
H  1.056894 -2.411734 -0.299328
H  0.296378 -1.308519 -1.472033
H  3.060856 1.81957 0.770273
H  1.723661 1.559806 1.936642
H  1.523651 2.549512 -0.980445
H  1.145687 3.483231 0.488503
H  2.667955 -1.792528 0.663831
H  2.947477 -0.674753 2.018074
H  -1.185874 3.93985 -0.387673
H  -0.417116 -4.315181 -0.202505
H  -4.252365 -1.275653 0.847397
H  -2.637408 -5.29039 0.455086
H  -4.550452 -3.75032 1.012755
H  3.614897 0.035618 -1.632565
H  5.332107 -0.867378 2.238469
H  -4.790716 1.707143 -2.104137
H  -5.882041 0.32058 -1.689276
H  -4.250674 -0.000127 -2.397085
H  5.928723 0.397706 -2.576236
H  7.633748 -0.508207 1.318086
H  -5.251594 2.542714 0.626163
H  -5.460791 4.243744 0.034004
H  -4.282092 3.887545 1.356163
H  7.942102 0.123816 -1.095594
