program: Gaussian 09
title: 000278159
version: EM64L-G09RevD.01
frameworkgroup: C1[X(C13H11N3)]
method: RPBEPBE
basis: SDD
operation: Freq
keyword: #pfreq=noraman
keyword: PBEPBE/SDD
title: #p freq=noraman PBEPBE/SDD
converged: NO YES NO NO
title: Mulliken charges:
elementType: N N N C C C C C C C C C C C C C H H H H H H H H H H H
charge: -0.169182 -0.025186 -0.009482 0.126155 -0.048471 0.026055 0.365920 -0.328113 -0.613362 -0.386927 -0.386943 -0.171752 -0.348793 -0.220432 -0.220428 -0.238109 0.257074 0.260329 0.244190 0.244237 0.244290 0.244287 0.228051 0.240050 0.228246 0.228245 0.230053
chargesum: 0.00000
title: Mulliken charges with hydrogens summed into heavy atoms:
elementType: N N N C C C C C C C C C C C C C
charge: -0.169182 -0.025186 -0.009482 0.126155 -0.048471 0.026055 0.365920 -0.071040 0.135394 -0.142638 -0.142657 0.056298 -0.108743 0.007814 0.007817 -0.008057
polarizability: 2.12233080e+02 -1.88215829e+00 1.47505412e+02 -3.75972520e-03 7.80090376e-03 1.08779818e+02
1716.lowfreq: -51.0648 -9.9049 -0.0007 -0.0006 -0.0006 6.3700 7.0759 66.2074 66.3516
frequency: -51.0141 66.2060 66.3239 89.1697 146.8762 211.9577 213.2615 234.1642 243.4648 305.9119 399.8794 424.6923 436.5192 462.7693 529.9957 576.3828 585.6798 603.7051 611.1562 659.1630 687.1133 703.8778 742.9322 772.1580 781.9304 786.4255 817.0022 854.3164 923.7375 934.8199 935.9770 976.8293 979.5739 988.1446 995.1566 998.4456 1023.7518 1029.5393 1076.9601 1090.9531 1128.3417 1132.0667 1172.3444 1187.1432 1190.5158 1216.7879 1268.5077 1310.8712 1315.9625 1362.3086 1369.7870 1383.3296 1397.2988 1428.4793 1428.5372 1452.6304 1465.4927 1467.8338 1495.8721 1515.0519 1545.8219 1584.2650 1596.5238 1618.8875 3002.3025 3093.7578 3123.4892 3123.8426 3130.8562 3136.1695 3142.2482 3148.6143 3151.6613 3165.4377 3173.5410
redmass: 3.9276 4.9969 4.2995 1.1114 2.9164 5.0585 3.8922 5.1261 3.4301 5.9322 2.8259 5.9847 4.3479 3.8673 6.6606 3.8738 5.5867 4.6281 6.4577 6.3562 7.3591 1.6842 4.9935 3.6753 3.0067 2.1153 2.3037 1.2444 1.4962 4.5203 1.4081 1.3859 1.3554 5.8757 1.8916 2.0370 2.4288 2.1995 1.6039 2.7061 1.3054 1.6314 1.0534 1.1192 2.4672 2.9695 2.5953 1.3644 3.7706 2.3656 7.0067 3.7284 3.1271 1.4992 2.1986 2.3515 1.7234 1.0432 1.6148 3.9111 6.7425 6.0039 7.4163 6.5153 1.0330 1.1026 1.1014 1.0846 1.0879 1.0886 1.0927 1.0915 1.0970 1.1018 1.0991
irintensity: 0.0101 0.5578 0.3792 0.6199 8.4030 0.1939 4.1268 0.7890 0.9304 3.5210 0.0052 0.1238 0.0000 5.5540 5.7482 1.8520 17.3430 6.4895 0.1232 6.1876 0.2224 55.9801 1.3436 16.2445 38.9805 39.1772 22.6126 0.0745 6.9800 29.0764 0.1145 0.0004 0.2435 1.9379 0.7477 0.4202 8.2738 4.3822 9.5622 6.9267 0.6058 0.2503 0.0070 1.7897 18.8946 21.2507 11.3391 0.3242 34.4738 27.6610 0.0422 11.4902 15.0901 2.5545 7.8659 34.4070 27.8087 15.8511 8.5031 21.4031 22.0939 1.3871 31.2780 0.7533 54.1340 19.1557 3.0124 1.2092 0.6556 10.0356 21.6809 9.7968 36.4509 21.3189 23.5410
temp: 298.150 k
press: 1.00000 atm
elementType: 7 7 7 6 6 6 6 6 6 6 6 6 6 6 6 6 1 1 1 1 1 1 1 1 1 1 1
symmnumber: 1
zpe: 552635.9 jmol-1
zpe.correction: 0.210488 hartree
zpe.thermalcorrener: 0.222345 hartree
zpe.thermalcorrenthalpy: 0.223289 hartree
zpe.thermalcorrgfe: 0.171880 hartree
zpe.sumelectzpe: -665.124022 hartree
zpe.sumelectthermal: -665.112164 hartree
zpe.sumelectthermalent: -665.111220 hartree
zpe.sumelectthermalfe: -665.162629 hartree
dipole: -0.4535 -1.5026 -0.0005
dipole: 1.5696
quadrupole: -85.7266 -87.1213 -88.8959
quadrupole: 3.7346 -0.0011 0.0022
quadrupole: 1.5213 0.1266 -1.6480 3.7346 -0.0011 0.0022
hfenergy: -665.3345096 hartree
pointgroup: C01 [X(C13H11N3)]
dipole: 0.15532 -0.5976737 0.0001828 debye
polarizability: 212.2815077|-0.6368171|147.456984|-0.00406|-0.0076489|108.7798177 unknown
InChI: InChI=1S/C13H11N3/c1-16-13-11(8-5-9-14-13)12(15-16)10-6-3-2-4-7-10/h2-9H,1H3
charge 0 multiplicity 1
27 atoms
N  -1.722165 1.652492 -0.000152
N  -0.326901 1.754992 -0.000061
N  -3.417955 -0.123106 -0.00004
C  -0.937757 -0.471095 0.000257
C  0.151973 0.474546 0.000085
C  -2.13466 0.328769 0.000008
C  1.612301 0.182571 0.00006
C  -1.097548 -1.880185 0.000473
C  -2.559431 2.84875 0.000083
C  2.316515 0.028334 -1.222261
C  2.316495 0.028049 1.222356
C  -2.415985 -2.378063 0.000434
C  -3.528737 -1.479453 0.000176
C  3.697348 -0.271532 -1.22273
C  3.697328 -0.27182 1.222777
C  4.391485 -0.423521 0.000012
H  -0.23212 -2.550955 0.000627
H  -3.60969 2.517491 -0.002385
H  -2.36225 3.456229 0.899299
H  -2.358639 3.458794 -0.896555
H  1.780163 0.152233 -2.16981
H  1.780129 0.151728 2.169926
H  -2.609839 -3.454869 0.000581
H  -4.551264 -1.873316 0.000121
H  4.22974 -0.38308 -2.173966
H  4.229704 -0.383589 2.173996
H  5.462558 -0.655498 -0.000007
