program: Gaussian 09
title: 000278147
version: EM64L-G09RevD.01
frameworkgroup: C1[X(C7H8N4)]
method: RPBEPBE
basis: SDD
operation: Freq
keyword: #p
keyword: freq=noraman
keyword: PBEPBE/SDD
title: #p freq=noraman PBEPBE/SDD
converged: NO NO NO NO
title: Mulliken charges:
elementType: N N N N C C C C C C C H H H H H H H H
charge: -0.164871 -0.074539 -0.016971 -0.652488 0.103935 0.055436 0.088128 -0.268018 -0.616103 -0.194156 -0.329765 0.232447 0.258017 0.239083 0.239031 0.225265 0.235756 0.316217 0.323597
chargesum: 0.00000
title: Mulliken charges with hydrogens summed into heavy atoms:
elementType: N N N N C C C C C C C
charge: -0.164871 -0.074539 -0.016971 -0.012674 0.103935 0.055436 0.088128 -0.035571 0.120028 0.031109 -0.094009
polarizability: 1.40215161e+02 -1.12070395e+00 1.18782400e+02 -2.46685944e-03 1.68404654e-02 4.66857814e+01
1716.lowfreq: -9.1916 -0.0005 -0.0002 0.0005 8.2218 14.1906 103.0381 142.6538 165.3267
frequency: 103.0125 142.6529 165.3249 203.4247 222.4659 233.4701 259.3886 347.6087 410.4558 433.7666 521.0077 556.1570 557.9760 561.1802 633.7957 651.2103 733.5729 774.8397 802.7398 815.1648 928.5118 962.0630 963.8177 1018.7762 1028.4847 1078.4490 1126.9112 1136.2739 1179.0722 1220.5106 1278.7870 1349.7948 1378.2293 1387.8417 1413.1988 1440.9611 1465.7162 1472.0237 1500.6878 1544.4592 1559.2080 1597.7050 1630.5231 2994.3901 3079.0979 3122.8006 3123.0452 3132.8487 3168.3485 3570.1053 3717.7715
redmass: 1.3384 1.8817 4.5512 1.1911 5.6693 3.3331 2.8601 2.4264 1.6526 2.9891 6.5953 4.0523 6.3985 3.7160 5.5439 7.0245 7.2017 2.0385 2.3666 5.5161 1.3936 2.4994 1.3597 2.8403 3.3459 2.0551 1.2977 1.4145 2.6522 2.7733 2.1745 2.8523 5.1427 2.5731 1.7435 1.8308 1.0435 1.5944 1.9095 6.1741 3.2724 4.3505 1.6386 1.0336 1.1022 1.0988 1.0909 1.0909 1.0979 1.0450 1.1044
irintensity: 0.8824 0.9334 1.0380 165.2877 11.3546 2.8449 7.2564 70.2928 79.2167 17.8865 1.7659 4.1862 8.6775 1.9152 13.0828 2.1622 10.4334 53.5882 21.8389 3.1320 0.0111 11.2696 0.9081 7.5256 4.0539 0.3814 0.8689 0.2013 32.7856 18.4304 24.9832 20.2713 41.9533 19.9586 39.4123 9.7222 15.0884 11.6463 58.8850 12.6494 87.4842 56.6119 319.0960 71.8834 26.1491 3.0498 8.2448 21.0648 25.1157 75.1553 32.5885
temp: 298.150 k
press: 1.00000 atm
elementType: 7 7 7 7 6 6 6 6 6 6 6 1 1 1 1 1 1 1 1
symmnumber: 1
zpe: 386989.7 jmol-1
zpe.correction: 0.147397 hartree
zpe.thermalcorrener: 0.157000 hartree
zpe.thermalcorrenthalpy: 0.157944 hartree
zpe.thermalcorrgfe: 0.112931 hartree
zpe.sumelectzpe: -489.750834 hartree
zpe.sumelectthermal: -489.741231 hartree
zpe.sumelectthermalent: -489.740287 hartree
zpe.sumelectthermalfe: -489.785300 hartree
dipole: 0.1931 -2.7105 0.0053
dipole: 2.7174
quadrupole: -59.5496 -50.5216 -67.9582
quadrupole: -1.2235 -0.0108 -0.0166
quadrupole: -0.2065 8.8215 -8.6151 -1.2235 -0.0108 -0.0166
hfenergy: -489.8982307 hartree
pointgroup: C01 [X(C7H8N4)]
dipole: 0.1130313 1.0631117 -0.0020787 debye
dipolederiv: -0.5757576 0.1397154 -0.0000469 -0.4181978 -0.5102189 -0.0002895 0.0006646 0.0009365 -0.1494845 -0.3087679 -0.5148675 -0.000144 0.1479024 -0.1455142 -0.0000793 -0.0001487 -0.0002256 -0.2271556 -0.5203746 -0.2107542 -0.0000109 0.0249146 -0.3565615 -0.0000409 0.000026 -0.0000882 -0.2157675 -0.4249883 0.5213205 -0.0000767 0.5563065 -1.1964503 -0.001097 0.0006496 -0.0025428 -0.7559347 -0.3265381 0.4345647 0.0001585 -0.5035381 -0.3683007 -0.0000691 -0.0000246 -0.000181 0.0301816 0.717199 0.2459077 -0.0000972 0.6484802 0.0666583 0.0000287 -0.0001456 -0.0001833 0.0865201 0.4670297 -0.7575071 -0.0001278 -0.7505392 1.2675835 0.0007358 -0.0001865 0.0006703 0.12159 0.4284846 -0.2299424 -0.0000503 0.0790247 0.1662056 0.0000641 -0.000003 0.0000864 -0.1152449 0.1938099 0.2216393 0.0002198 0.3301394 0.5021504 0.0005332 -0.0000988 0.0002696 0.2284039 -0.2043953 0.1781728 0.0000571 0.2155641 -0.392811 -0.0000232 0.0000707 0.0000102 -0.1730949 0.2949123 0.1374739 0.0000276 -0.1251463 0.4993674 0.0000944 0.000016 0.0001421 -0.0916481 0.0917099 0.0139741 0.0000028 -0.0302875 -0.1115387 -0.0000428 -0.0000159 -0.0000692 0.1482349 0.0336488 0.1186169 -0.0003995 0.0258902 0.0406024 0.0001006 -0.0003031 0.0000994 0.1298177 -0.0018642 -0.118426 0.1004646 -0.0690206 0.0209582 -0.0017302 0.1297696 0.0803238 -0.0580552 -0.0012438 -0.1183372 -0.1001502 -0.0695007 0.0203002 0.0014302 -0.129757 -0.0810753 -0.0590563 -0.0905901 -0.075934 -0.0000265 -0.0841686 0.0549541 -0.0000307 -0.0000356 -0.000038 0.1786065 -0.0925619 0.0807394 0.0000038 0.1031768 0.0348471 -0.0000123 0.0000053 -0.0000217 0.1302549 0.1271912 -0.0211239 0.0003164 -0.0466648 0.2327566 0.0002869 0.0001062 0.00125 0.3979818 0.1930964 -0.0452324 -0.0001204 -0.0343352 0.1750116 0.0001411 -0.0005894 0.0006368 0.3938504 unknown
polarizability: 140.2671614|0.372499|118.7303997|0.0030515|0.0167444|46.6857814 unknown
InChI: InChI=1S/C7H8N4/c1-11-7-5(6(8)10-11)3-2-4-9-7/h2-4H,8H2,1H3
charge 0 multiplicity 1
19 atoms
N  -1.14082 -1.071662 0.000044
N  -2.033852 0.02088 -0.00011
N  1.281304 -1.439837 -0.00026
N  -1.814853 2.406843 0.000685
C  0.152044 0.793835 0.000032
C  0.170992 -0.650146 -0.000173
C  -1.252544 1.140625 0.000088
C  1.399078 1.465226 0.000234
C  -1.648854 -2.437412 -0.000533
C  2.564693 0.670252 0.000125
C  2.456047 -0.75709 -0.000127
H  1.467668 2.56007 0.000518
H  -0.78127 -3.115341 0.001484
H  -2.266079 -2.621318 0.895975
H  -2.262428 -2.622187 -0.899406
H  3.559972 1.12506 0.000275
H  3.363775 -1.371697 -0.000186
H  -1.232865 3.23779 -0.001427
H  -2.82681 2.503207 -0.000138
