program: Gaussian 09
title: 000278149
version: EM64L-G09RevD.01
frameworkgroup: C1[X(C7H6BrN3)]
method: RPBEPBE
basis: SDD
operation: Freq
keyword: #p
keyword: freq=noraman
keyword: PBEPBE/SDD
title: #p freq=noraman PBEPBE/SDD
converged: NO NO NO NO
title: Mulliken charges:
elementType: Br N N N C C C C C C C H H H H H H
charge: 0.029354 -0.181208 0.026925 -0.010044 0.053476 0.346284 -0.388338 -0.263569 -0.608844 -0.176081 -0.324912 0.259158 0.262673 0.249026 0.249055 0.233204 0.243839
chargesum: 0.00000
title: Mulliken charges with hydrogens summed into heavy atoms:
elementType: Br N N N C C C C C C C
charge: 0.029354 -0.181208 0.026925 -0.010044 0.053476 0.346284 -0.388338 -0.004410 0.151910 0.057123 -0.081073
polarizability: 1.52053053e+02 4.87819576e+00 1.28107614e+02 1.00802930e-03 7.99461300e-03 4.62109406e+01
1716.lowfreq: -2.3189 -0.0009 -0.0007 -0.0006 6.3369 11.2147 87.8895 119.2312 139.4124
frequency: 87.8778 119.2311 139.4123 147.4030 227.1688 232.2177 309.3474 322.9395 437.3260 527.9293 551.7788 572.2492 590.3206 623.8651 742.8883 759.2223 782.3293 815.1809 936.5169 937.8099 980.3112 982.6744 1026.6078 1119.2851 1128.2702 1139.4029 1209.9108 1261.7508 1296.8862 1327.2299 1368.0087 1382.2706 1415.8943 1447.6711 1466.9164 1466.9897 1498.8194 1544.9399 1601.3640 3007.4193 3101.2599 3127.8364 3142.7247 3152.8615 3178.4137
redmass: 1.0914 6.0522 8.2517 2.8856 3.3316 6.0932 9.4061 6.0492 4.3098 7.1791 5.5639 3.9838 6.3578 7.4523 8.2125 6.2148 2.6273 1.8723 5.6243 1.4052 1.3526 3.8607 2.2807 1.6272 1.3030 2.7649 2.2132 3.1485 5.2035 2.7007 2.3565 5.8858 1.7335 1.9403 1.4340 1.1888 1.6127 6.6716 7.8902 1.0328 1.1029 1.1017 1.0887 1.0919 1.0991
irintensity: 0.4756 0.9455 0.6354 9.8594 5.9055 0.1719 1.5004 0.0066 0.0034 8.7978 0.1076 1.7674 15.6576 0.0099 11.1733 2.9953 32.9761 36.1247 68.6098 0.0028 0.5743 3.4057 3.0733 27.7167 0.7804 24.6819 24.0898 4.5505 34.8773 54.7736 15.7189 20.0436 19.2725 41.4608 16.5954 16.8559 21.0516 28.2124 41.5356 44.6874 17.5033 3.0867 8.6151 7.6326 19.6238
temp: 298.150 k
press: 1.00000 atm
elementType: 35 7 7 7 6 6 6 6 6 6 6 1 1 1 1 1 1
symmnumber: 1
zpe: 318438.3 jmol-1
zpe.correction: 0.121287 hartree
zpe.thermalcorrener: 0.130596 hartree
zpe.thermalcorrenthalpy: 0.131540 hartree
zpe.thermalcorrgfe: 0.085307 hartree
zpe.sumelectzpe: -447.259948 hartree
zpe.sumelectthermal: -447.250639 hartree
zpe.sumelectthermalent: -447.249695 hartree
zpe.sumelectthermalfe: -447.295928 hartree
dipole: -1.9961 -1.2976 0.0002
dipole: 2.3808
quadrupole: -73.1328 -61.0934 -74.9777
quadrupole: -2.0786 -0.0005 0.0009
quadrupole: -3.3982 8.6412 -5.2430 -2.0786 -0.0005 0.0009
hfenergy: -447.3812351 hartree
pointgroup: C01 [X(C7H6Br1N3)]
dipole: 0.9326032 -0.0873135 0.000084 debye
dipolederiv: -0.3159027 0.2782413 0.0000136 0.3429021 -0.4062483 -0.0000121 -0.0000306 0.0000112 -0.0015968 -0.4892489 0.3034072 0.0000207 -0.1680464 -0.5728835 0.0001841 -0.0002048 -0.0005317 -0.1305366 -0.3329422 -0.4044788 0.0000193 -0.124088 -0.0399878 -0.0000272 0.000095 0.0001027 -0.1373531 -0.4741462 -0.1636469 0.0000508 0.0607793 -0.4392133 0.0000309 -0.0000066 0.0000404 -0.2066309 0.4460297 0.2673107 -0.0000419 0.5185264 0.2027094 -0.0000368 -0.0000116 0.000072 0.0967449 -0.2077717 0.2882467 -0.0000312 -0.1217155 -0.5227638 0.0000411 0.0000428 -0.0000008 0.0794545 0.7892064 -0.7086132 0.0000501 -0.7155527 0.7199676 0.0000556 0.0000027 0.0000209 -0.09866 0.3740077 -0.1376098 -0.0000146 0.0952782 0.1687368 -0.0000147 -0.0000416 -0.0000007 -0.0964174 0.0653762 0.1188764 0.0000054 0.172548 0.5593807 -0.0003701 0.0000541 -0.0001562 0.2070892 -0.2374116 0.1979616 -0.0000163 0.2870155 -0.2308143 -0.0000266 0.000095 -0.0000306 -0.1396415 0.3145294 0.0490875 -0.0000457 -0.2380906 0.4407724 -0.0000007 -0.0000851 -0.0000094 -0.0814462 0.0951556 0.0419277 -0.000001 -0.0011966 -0.0422907 -0.0000032 -0.0000216 0.0000063 0.1520656 0.0053674 0.0996983 0.000342 0.0169857 0.0715413 0. 0.0002327 -0.0000229 0.1338161 0.0570304 -0.0937595 0.0914684 -0.0440203 -0.0042983 0.0109535 0.0935527 0.0869095 -0.0407112 0.056573 -0.0940662 -0.0918526 -0.043811 -0.0038026 -0.01079 -0.0937078 -0.0864124 -0.0399465 -0.0419051 -0.0877463 0.0000288 -0.1006434 0.0288053 0.0000187 0.0000175 0.0000042 0.1715796 -0.1039476 0.0451633 0.0000041 0.063129 0.0703891 -0.0000026 0.0000171 -0.0000025 0.1321901 unknown
polarizability: 147.5732864|-10.5355809|132.587381|-0.0057532|-0.0056418|46.2109406 unknown
InChI: InChI=1S/C7H6BrN3/c1-11-7-5(6(8)10-11)3-2-4-9-7/h2-4H,1H3
charge 0 multiplicity 1
17 atoms
Br -2.565827 2.361339 0.000152
N  -0.889691 -1.324332 0.000096
N  -1.978222 -0.445078 0.000175
N  1.560038 -1.180225 -0.000011
C  0.316184 -0.635632 0.000071
C  -0.00395 0.77126 0.000122
C  -1.435608 0.797169 0.00015
C  1.075003 1.690047 0.000086
C  -1.098847 -2.771388 0.000435
C  2.375011 1.148271 0.000008
C  2.570017 -0.269474 -0.000036
H  0.902425 2.771266 0.000102
H  -0.10644 -3.248423 -0.001388
H  -1.65802 -3.077604 0.899928
H  -1.66135 -3.077356 -0.897034
H  3.253701 1.799591 -0.00003
H  3.584078 -0.683629 -0.000127
