program: Gaussian 09
title: 000278148
version: EM64L-G09RevD.01
frameworkgroup: C1[X(C9H10BrN3)]
method: RPBEPBE
basis: SDD
operation: Freq
keyword: #p
keyword: freq=noraman
keyword: PBEPBE/SDD
title: #p freq=noraman PBEPBE/SDD
converged: NO NO NO NO
title: Mulliken charges:
elementType: Br N N N C C C C C C C C C H H H H H H H H H H
charge: 0.014595 -0.193468 -0.024417 0.024569 0.251568 0.002611 0.445953 -0.482412 0.199043 -0.462259 -0.807877 -0.615162 -0.786141 0.236927 0.227483 0.249823 0.249816 0.246812 0.246791 0.261699 0.231300 0.231187 0.251561
chargesum: 0.00000
title: Mulliken charges with hydrogens summed into heavy atoms:
elementType: Br N N N C C C C C C C C C
charge: 0.014595 -0.193468 -0.024417 0.024569 0.251568 0.002611 0.445953 -0.245485 0.199043 -0.462259 -0.080755 0.140140 -0.072093
polarizability: 1.89490141e+02 -2.77590414e+00 1.52875631e+02 6.74983296e-03 -8.69204595e-03 6.55006928e+01
1716.lowfreq: -8.4691 -6.5986 -0.0004 -0.0003 0.0007 10.8294 56.7913 66.1445 92.1015
frequency: 56.7712 66.1132 92.0991 129.8529 130.1901 138.1810 174.6997 214.3820 218.9199 267.3090 269.1357 269.9162 369.8756 376.9235 488.4130 534.3513 548.1704 560.8746 610.2905 617.4505 636.0608 718.5789 791.6492 859.5800 876.9805 949.9049 967.7904 987.4547 1021.0063 1044.4928 1046.6578 1051.4217 1127.9518 1188.1799 1209.5479 1237.4073 1287.6148 1326.9182 1346.3612 1383.1681 1390.9908 1402.3506 1411.7061 1435.3064 1455.2097 1462.7158 1466.4562 1467.8154 1469.9283 1476.5876 1505.2847 1572.3901 1582.5270 2983.1887 2987.0330 3005.0290 3060.3294 3068.7901 3094.6665 3097.3285 3117.9469 3127.1864 3141.5528
redmass: 1.2074 2.5247 1.1394 7.4514 2.6677 1.0610 3.5527 2.9554 4.6093 4.8800 3.2261 5.3239 3.6622 6.6440 6.4187 5.5506 4.4486 4.4047 4.2950 6.1186 4.4682 6.9363 7.6393 5.7310 1.2676 4.1705 2.1884 4.2485 1.5504 1.5573 1.5937 2.2132 1.3034 2.0605 3.1136 4.3333 5.0121 5.9305 4.3403 6.5686 1.2988 1.2440 2.0498 2.0115 1.3880 1.0444 1.0453 1.0438 1.1325 1.2693 1.9122 6.8435 7.6283 1.0382 1.0369 1.0329 1.0972 1.0968 1.1001 1.1028 1.0982 1.1015 1.0917
irintensity: 0.1961 0.4398 0.5679 0.8832 8.8614 0.3555 0.1339 3.9117 0.0568 0.9532 1.7991 0.9289 3.3073 1.8271 0.2940 4.4571 2.5384 6.4973 4.6600 3.0128 0.2817 18.0949 0.0168 24.0508 15.1153 5.6866 2.1855 20.9082 8.9278 4.7717 10.9860 58.3810 0.7565 30.0573 12.4832 15.6853 42.1967 4.0293 11.3050 43.0814 32.7999 19.3120 20.3609 44.5063 26.4012 18.1153 1.2930 28.0994 32.2443 13.5461 7.7845 88.1249 115.8646 20.8743 13.7328 50.4830 17.3054 10.2929 20.4107 18.6752 9.7890 3.0843 12.2668
temp: 298.150 k
press: 1.00000 atm
elementType: 35 7 7 7 6 6 6 6 6 6 6 6 6 1 1 1 1 1 1 1 1 1 1
symmnumber: 1
zpe: 460412.5 jmol-1
zpe.correction: 0.175362 hartree
zpe.thermalcorrener: 0.188310 hartree
zpe.thermalcorrenthalpy: 0.189254 hartree
zpe.thermalcorrgfe: 0.134791 hartree
zpe.sumelectzpe: -525.723613 hartree
zpe.sumelectthermal: -525.710665 hartree
zpe.sumelectthermalent: -525.709721 hartree
zpe.sumelectthermalfe: -525.764183 hartree
dipole: 2.6132 -1.6611 0.0012
dipole: 3.0965
quadrupole: -85.2416 -73.8584 -87.1731
quadrupole: 1.3976 0.0027 -0.0017
quadrupole: -3.1506 8.2326 -5.0820 1.3976 0.0027 -0.0017
hfenergy: -525.8989746 hartree
pointgroup: C01 [X(C9H10Br1N3)]
dipole: 1.2043096 0.1838061 -0.0004603 debye
dipolederiv: -0.4295016 0.2857816 -0.0000425 0.3404077 -0.3265849 0.0000293 0.0002888 -0.0001042 -0.0120256 -0.4548144 0.2766762 -0.0001284 -0.1697709 -0.5741144 -0.0000515 0.0000156 0.0004193 -0.1295765 -0.716667 -0.1483103 0.0000038 -0.0017664 -0.51034 0.000027 0.0000121 -0.0000185 -0.2185062 -0.3626329 -0.4402554 0.0001087 -0.1433388 -0.1411499 0.0000854 -0.0000568 -0.0000011 -0.1470928 -0.3143925 0.2433711 0.0000743 -0.0221334 -0.6209257 0.0001115 -0.0002719 0.000187 0.0341527 0.4426239 0.2846884 0.0000255 0.428063 0.3332058 -0.000028 0.0002417 -0.0001872 0.0997721 0.5420495 -0.2096604 -0.0000494 0.0885652 0.5045134 -0.0000807 0.0000099 -0.0001981 0.017598 -0.4718247 0.3201749 -0.0000987 0.3856131 -0.3551408 -0.0000765 -0.0000144 -0.0000743 -0.1806345 0.8142211 -0.0337453 -0.0002125 -0.2923303 0.5401597 0.0001047 -0.000931 0.0001742 0.0306141 0.9937997 -0.585517 0.0000739 -0.6737637 0.542981 -0.000236 0.0000227 -0.0000359 -0.0911895 0.0199441 0.1755686 0.0000271 0.0567489 -0.1742538 0.0000555 -0.0005016 0.0005335 0.0289765 0.0419878 0.0618689 0.0000005 0.1386208 0.5901077 0.0002192 -0.0005284 0.000254 0.2089144 -0.3245597 0.0682478 0.000161 0.002108 0.0239645 0.0000836 0.0013079 0.0000274 0.0438179 -0.0170154 -0.0900906 0.0000443 -0.116533 -0.0027942 0.0000046 -0.0000441 0.0000007 0.1560081 -0.0832258 -0.1686289 -0.0002034 -0.0542332 0.0084418 -0.0000912 -0.00014 -0.000177 0.1108567 0.0527604 0.0363583 -0.0987579 0.020565 0.0392271 0.0078777 -0.086329 0.0486648 -0.0179391 0.0522034 0.0364846 0.0989161 0.0207248 0.0392787 -0.0077617 0.0869412 -0.0488372 -0.017566 0.0650724 -0.0893993 0.0896993 -0.0395205 -0.0222906 0.0222328 0.0874956 0.1002127 -0.0432134 0.0656209 -0.0892412 -0.0894311 -0.039463 -0.0227175 -0.0223373 -0.0869517 -0.100701 -0.0437001 -0.0033461 0.1008964 -0.000258 0.0156502 0.0873837 -0.0000223 -0.0001356 -0.000015 0.130238 -0.0060632 -0.0036137 0.0643482 -0.013077 0.0684703 0.088662 0.118921 0.0588206 -0.0388092 -0.0059755 -0.004154 -0.0643865 -0.0140928 0.0673917 -0.0894553 -0.1188977 -0.0596071 -0.0375308 0.0997357 -0.0275008 0.0000857 0.0829563 -0.0948137 0.0006472 -0.0004544 0.0006623 0.1168352 unknown
polarizability: 185.5916726|-11.6296218|156.7740995|-0.0096802|-0.0052349|65.5006928 unknown
InChI: InChI=1S/C9H10BrN3/c1-5-4-6(2)11-9-7(5)8(10)12-13(9)3/h4H,1-3H3
charge 0 multiplicity 1
23 atoms
Br -3.20687 1.828047 -0.000659
N  -1.102898 -1.619714 -0.000176
N  1.310945 -1.23486 -0.000326
N  -2.278953 -0.864764 -0.000126
C  -0.440489 0.558427 -0.00045
C  0.021947 -0.806292 -0.000353
C  0.547878 1.591631 -0.000491
C  1.885831 1.14956 -0.000471
C  2.243389 -0.24273 -0.000417
C  -1.869695 0.428051 -0.000487
C  0.194074 3.062027 -0.000637
C  -1.153763 -3.080065 -0.000244
C  3.698258 -0.660623 -0.000762
H  2.695249 1.887648 -0.000494
H  1.102994 3.686779 0.000273
H  -0.410967 3.326622 -0.886983
H  -0.412702 3.326448 0.884553
H  -1.679584 -3.445624 0.89745
H  -1.67748 -3.445752 -0.899134
H  -0.115387 -3.44611 0.00094
H  4.224477 -0.271606 -0.892665
H  4.226707 -0.265882 0.887259
H  3.770037 -1.758915 0.002499
