program: Gaussian 09
title: 000278199
version: EM64L-G09RevD.01
frameworkgroup: C1[X(C11H15N5O6)]
method: RPBEPBE
basis: SDD
operation: Freq
keyword: #p
keyword: freq=noraman
keyword: PBEPBE/SDD
title: #p freq=noraman PBEPBE/SDD
converged: YES YES NO NO
title: Mulliken charges:
elementType: O O O O O O N N N N N C C C C C C C C C C C H H H H H H H H H H H H H H H
charge: -0.337682 -0.463671 -0.463426 -0.435495 -0.336655 -0.266288 -0.266556 -0.197979 -0.423184 -0.049383 -0.619755 -0.027631 -0.204371 -0.155632 -0.026153 0.362765 -0.368981 0.240138 0.038863 0.032264 -0.628940 0.157235 0.272588 0.244738 0.249397 0.227160 0.266123 0.212666 0.399090 0.385715 0.386283 0.297513 0.242097 0.243371 0.337487 0.354075 0.322211
chargesum: 0.00000
title: Mulliken charges with hydrogens summed into heavy atoms:
elementType: O O O O O O N N N N N C C C C C C C C C C C
charge: -0.337682 -0.064581 -0.077711 -0.098008 -0.336655 -0.266288 -0.266556 -0.197979 -0.036900 -0.049383 0.056531 0.244957 0.040367 0.093765 0.201007 0.362765 0.109809 0.240138 0.038863 0.032264 0.154041 0.157235
polarizability: 2.16620054e+02 3.83805784e-01 2.10607688e+02 -3.13706158e+00 1.47592291e+00 9.92779472e+01
1716.lowfreq: -6.2420 -0.0013 -0.0007 -0.0006 1.5709 7.0451 30.4248 38.2637 54.5477
frequency: 30.4048 38.2196 54.5436 64.4955 78.2593 99.1465 104.8901 127.0163 127.9276 160.2131 191.7678 205.5277 211.6740 227.2083 239.5296 254.4733 276.5809 290.2323 308.6638 317.7700 331.8857 337.5805 346.6789 368.9050 410.5246 437.5953 449.2219 466.4880 520.9576 526.6234 559.1592 570.7709 600.9787 618.1705 620.3839 667.5625 682.4124 697.3759 720.3679 729.5469 746.4383 764.0124 780.2172 786.7535 806.9223 855.4525 887.4759 923.5910 963.3638 971.2980 978.5799 992.6099 1005.4236 1034.5922 1045.2190 1073.8013 1084.9712 1096.4480 1123.7341 1135.2595 1147.6749 1172.4336 1184.7114 1210.2356 1242.3530 1256.2029 1262.5799 1274.6594 1286.9003 1308.7213 1314.3295 1326.0717 1340.6253 1351.6298 1360.5327 1374.6486 1375.3276 1387.3155 1400.6863 1422.4352 1444.1873 1451.7487 1483.1776 1485.5709 1528.1731 1563.2444 1591.1264 1625.2242 1630.9530 1662.4364 2982.4967 2984.5373 2988.9201 2994.5739 2998.2354 3009.6217 3093.2354 3118.0141 3133.0753 3167.9277 3443.2616 3460.7502 3552.2472 3561.3312 3705.1335
redmass: 5.2991 5.9722 2.6269 3.9276 4.1145 2.9054 6.2524 3.8187 2.6803 4.4966 6.0213 4.5643 6.9139 4.5187 5.2593 4.7712 1.8492 2.3500 4.5880 1.1702 4.3775 5.4412 8.0475 5.1933 4.5511 5.8854 6.3965 2.9170 1.1332 1.2161 8.0998 6.4432 5.1728 7.5812 8.3992 5.6777 9.9343 10.0938 1.1526 4.6881 8.7444 6.8834 4.5339 1.1207 4.7717 3.8498 4.6684 2.3933 5.1222 2.8377 2.8915 3.2046 3.1416 5.9177 2.7294 4.3381 3.8234 2.4150 3.0734 1.2940 2.9811 1.4286 1.3411 3.6061 1.2327 1.9338 1.5752 1.2084 1.5303 1.2463 1.2342 1.4135 1.2419 2.9071 1.8045 3.6921 1.4077 1.6278 1.6321 2.7290 1.0795 1.5217 1.0881 1.1111 5.1585 5.4431 2.2887 2.0719 6.7282 8.4188 1.0837 1.0835 1.0716 1.0845 1.0328 1.0882 1.1025 1.1039 1.0950 1.0670 1.0802 1.0647 1.0452 1.0665 1.1055
irintensity: 1.2727 1.1908 7.1072 3.7468 0.2200 1.3160 2.4929 14.8777 5.6226 5.8435 3.3492 2.8178 0.6611 7.4106 12.6399 15.0311 128.2490 53.5566 7.7012 81.4285 6.7145 20.5240 6.8923 7.7765 11.8661 2.6164 21.7828 56.7420 184.3226 196.0419 1.5436 4.5981 6.7362 9.3035 13.7785 20.6217 1.0916 14.7017 109.8120 33.2608 6.2139 42.0125 5.9449 187.0804 50.1409 9.4130 24.6056 0.6281 66.5397 16.6932 45.5755 58.1024 97.1263 63.0431 10.2129 53.2571 74.2804 62.9883 2.6864 0.2131 47.6759 21.0117 34.6065 8.8291 55.3550 1.1198 3.9267 41.8863 32.3560 53.9688 24.6762 11.8799 11.6853 123.5435 4.5990 16.6543 95.4544 20.1814 339.9778 45.0762 12.0944 99.4565 20.5230 22.3323 294.3012 170.3977 295.1885 687.8442 183.3026 327.7505 12.7185 3.0769 24.6444 28.9973 47.0998 99.8196 18.7591 2.3730 9.0565 509.7781 258.1757 44.2549 113.8922 7.0895 51.0072
temp: 298.150 k
press: 1.00000 atm
elementType: 8 8 8 8 8 8 7 7 7 7 7 6 6 6 6 6 6 6 6 6 6 6 1 1 1 1 1 1 1 1 1 1 1 1 1 1 1
symmnumber: 1
zpe: 734430.4 jmol-1
zpe.correction: 0.279730 hartree
zpe.thermalcorrener: 0.300631 hartree
zpe.thermalcorrenthalpy: 0.301575 hartree
zpe.thermalcorrgfe: 0.229918 hartree
zpe.sumelectzpe: -1151.627160 hartree
zpe.sumelectthermal: -1151.606259 hartree
zpe.sumelectthermalent: -1151.605314 hartree
zpe.sumelectthermalfe: -1151.676972 hartree
dipole: 6.2001 3.2435 2.0418
dipole: 7.2891
quadrupole: -160.9248 -118.3645 -123.1258
quadrupole: 9.4227 12.9096 4.0172
quadrupole: -26.7864 15.7738 11.0126 9.4227 12.9096 4.0172
hfenergy: -1151.9068895 hartree
pointgroup: C01 [X(C11H15N5O6)]
dipole: 2.483789 -1.1990171 -0.7855377 debye
polarizability: 216.7136477|-0.0109748|210.4573149|1.0439536|-4.1009908|99.3347271 unknown
InChI: InChI=1S/C11H15N5O6/c1-15-4-7(13-10(12)14-8(4)20)16(11(15)21)9-6(19)5(18)3(2-17)22-9/h3,5-6,9,13,17-19H,2,12H2,1H3
charge 0 multiplicity 1
37 atoms
O  1.737393 -0.778828 -0.039544
O  2.337492 2.840861 -0.161175
O  4.215165 1.070912 0.550129
O  3.594114 -3.074007 -0.099978
O  -0.346473 3.049886 -0.131104
O  -4.707184 -0.357783 -0.174715
N  -0.140541 0.652301 0.01798
N  -2.207524 1.524788 -0.143492
N  -0.80073 -1.751211 0.190559
N  -3.187256 -2.147054 0.102397
N  -1.694264 -3.935646 0.349167
C  1.305664 0.590194 0.261945
C  2.140378 1.50774 -0.675638
C  3.498161 0.764935 -0.684145
C  3.092845 -0.722523 -0.700681
C  -1.05397 -0.397921 0.069672
C  4.037135 -1.677547 0.034012
C  -0.863257 1.881295 -0.094642
C  -2.339224 0.113941 -0.041115
C  -3.510096 -0.768002 -0.050506
C  -3.305521 2.497064 -0.264625
C  -1.934395 -2.58316 0.210987
H  1.528472 0.83277 1.321005
H  1.684747 1.501671 -1.687338
H  4.107929 1.034392 -1.568575
H  2.943256 -1.058811 -1.747348
H  4.020096 -1.459308 1.110329
H  5.072443 -1.535643 -0.338221
H  1.410867 3.245256 -0.082726
H  4.014172 2.027337 0.75215
H  0.178812 -2.064701 0.190252
H  -4.247508 1.928697 -0.312099
H  -3.177539 3.100871 -1.178753
H  -3.314492 3.172847 0.607463
H  3.827185 -3.406396 -1.003598
H  -2.511841 -4.540457 0.361711
H  -0.76921 -4.322362 0.517663
