program: Gaussian 09
title: 000278186
version: EM64L-G09RevD.01
frameworkgroup: C1[X(C21H19N)]
method: RPBEPBE
basis: SDD
operation: Freq
keyword: #pfreq=noraman
keyword: PBEPBE/SDD
title: #p freq=noraman PBEPBE/SDD
converged: YES YES NO NO
title: Mulliken charges:
elementType: N C C C C C C C C C C C C C C C C C C C C C H H H H H H H H H H H H H H H H H H H
charge: -0.196513 0.075945 0.143206 -0.523401 0.282535 0.355555 0.380566 -0.655503 -0.355554 -0.419243 -0.403271 -0.369060 -0.394835 -0.385814 -0.251936 -0.229180 -0.252020 -0.270344 -0.235553 -0.254455 -0.248377 -0.247243 0.231080 0.205056 0.219607 0.235166 0.221703 0.253121 0.240629 0.259659 0.258653 0.273724 0.256071 0.225443 0.223550 0.224559 0.226447 0.222391 0.223962 0.225951 0.227724
chargesum: 0.00000
title: Mulliken charges with hydrogens summed into heavy atoms:
elementType: N C C C C C C C C C C C C C C C C C C C C C
charge: -0.196513 0.075945 0.143206 -0.087265 0.282535 0.355555 0.380566 0.020972 -0.102433 -0.178614 -0.143612 -0.110407 -0.121111 -0.129744 -0.026494 -0.005629 -0.027462 -0.043896 -0.013162 -0.030494 -0.022426 -0.019519
polarizability: 2.46100563e+02 -6.14972411e+00 2.25183959e+02 1.29458304e+00 -8.13162943e+00 1.91713789e+02
1716.lowfreq: -10.9749 -9.1216 -0.0002 0.0008 0.0008 2.9040 44.8050 53.6124 62.2450
frequency: 44.7341 53.5746 62.2370 70.2483 82.1178 94.7957 131.8159 189.7724 217.3523 233.6451 239.2571 249.5477 277.8823 289.5924 297.0471 345.9568 351.2265 406.1998 412.9152 425.3582 456.6046 465.1781 508.4506 524.7146 561.0833 603.5457 615.9652 617.4955 628.8780 650.6748 683.5075 708.9558 712.3529 725.6653 756.8678 760.0446 772.8137 824.5376 860.1584 868.8218 869.9221 878.3887 900.3788 927.3191 940.3872 945.9907 952.6560 984.0481 986.2373 989.8116 990.3201 992.2026 995.6616 1000.3823 1006.6708 1013.4476 1025.2800 1026.9200 1030.4371 1078.1816 1083.0393 1094.2105 1111.1915 1140.2214 1154.2115 1167.4986 1170.4262 1172.5063 1178.8597 1182.5537 1186.4424 1197.3440 1209.3066 1228.5012 1251.7473 1277.1269 1309.1940 1325.5698 1328.5343 1372.9260 1379.0346 1394.6817 1429.8963 1433.2620 1435.5591 1447.6507 1465.8538 1471.6295 1475.8702 1478.6261 1482.2240 1486.3892 1583.7903 1589.1740 1599.3570 1606.4053 1609.3656 1622.5820 2847.9036 2903.0397 2991.8466 3017.8011 3071.0286 3117.6911 3119.1378 3121.7106 3125.3466 3126.1948 3132.0342 3138.1141 3139.4501 3144.9523 3148.0125 3148.6469 3160.5696 3161.0763 3161.8609
redmass: 3.7510 4.6873 4.3494 4.0119 4.4436 4.0681 3.1663 2.8071 3.9337 3.1106 3.4468 1.2131 3.4933 4.1130 4.5189 4.4159 4.0712 2.8600 2.9328 3.0010 4.4586 3.7325 3.6678 3.6976 3.4332 5.8165 6.3657 6.3771 5.5175 6.0179 6.0910 1.7240 1.9958 2.6488 1.6513 1.5824 1.9040 4.0410 1.2500 1.2949 1.4946 2.9467 2.8175 2.1817 2.2906 1.5158 1.8592 1.3840 1.3507 5.1431 4.2270 1.4921 1.4365 2.1145 1.3853 1.7791 2.1316 2.1073 2.2256 1.5729 1.9132 1.8634 1.2957 1.7769 1.7194 1.0953 1.1124 1.0541 2.0673 1.3383 1.6425 1.1315 3.4081 3.1682 3.2882 1.5479 1.3777 1.3849 1.7489 6.7396 9.1309 6.2498 1.7857 1.3351 2.2389 2.4092 1.1055 2.4394 2.2116 1.9992 1.0939 1.0930 5.9213 6.3251 7.0776 5.9593 6.1712 7.0971 1.0714 1.0504 1.0869 1.0807 1.0997 1.0845 1.0843 1.0856 1.0877 1.0874 1.0893 1.0926 1.0922 1.0944 1.0949 1.0947 1.1009 1.1004 1.1011
irintensity: 0.0629 0.2348 0.0399 0.2163 0.2970 0.5098 1.5552 1.3662 0.6844 0.2630 1.5860 1.0232 1.3393 0.6000 1.4142 15.2798 5.6804 0.0403 0.0234 5.7801 1.1747 4.0514 2.4073 0.8640 10.9727 1.6221 0.1607 0.0289 27.1159 7.1153 0.6373 61.2978 28.5893 20.8638 54.0418 56.4979 42.0788 2.6475 0.1620 0.4922 2.1056 2.6616 13.9056 1.9226 1.7966 0.3743 0.8657 0.8330 0.3073 2.2265 0.4335 1.3933 5.4078 29.4165 2.1326 6.1602 6.4072 6.0441 9.6016 8.7298 3.8087 4.6691 7.8416 4.5368 3.2294 2.7693 0.4863 0.0682 5.2684 11.0846 3.3277 1.3722 16.6285 15.0193 10.6386 4.1184 3.5581 0.7872 4.3594 0.9165 0.7708 1.4869 6.3445 11.4610 8.3127 11.2427 19.5093 14.8719 18.9410 21.9860 7.7093 7.0764 0.4789 0.4349 0.4750 10.5646 8.4924 1.5915 79.2170 94.4022 45.6253 43.3168 25.3910 2.9631 2.2828 1.7793 4.2624 2.8577 9.1554 33.4681 12.6898 25.2522 28.7158 24.5594 39.8242 37.5414 16.2811
temp: 298.150 k
press: 1.00000 atm
elementType: 7 6 6 6 6 6 6 6 6 6 6 6 6 6 6 6 6 6 6 6 6 6 1 1 1 1 1 1 1 1 1 1 1 1 1 1 1 1 1 1 1
symmnumber: 1
zpe: 880603.5 jmol-1
zpe.correction: 0.335404 hartree
zpe.thermalcorrener: 0.353244 hartree
zpe.thermalcorrenthalpy: 0.354188 hartree
zpe.thermalcorrgfe: 0.289823 hartree
zpe.sumelectzpe: -864.848852 hartree
zpe.sumelectthermal: -864.831013 hartree
zpe.sumelectthermalent: -864.830068 hartree
zpe.sumelectthermalfe: -864.894433 hartree
dipole: 0.6904 0.4553 0.3988
dipole: 0.9182
quadrupole: -118.9406 -124.8602 -121.6088
quadrupole: -2.4177 1.4477 -0.5083
quadrupole: 2.8626 -3.0570 0.1944 -2.4177 1.4477 -0.5083
hfenergy: -865.1842565 hartree
pointgroup: C01 [X(C21H19N1)]
dipole: -0.2110454 -0.2457677 0.1598698 debye
polarizability: 247.5580945|0.2304548|223.3439802|-4.8465895|7.8461307|192.0962362 unknown
InChI: InChI=1S/C21H19N/c1-22-16-17-10-8-9-15-20(17)21(22,18-11-4-2-5-12-18)19-13-6-3-7-14-19/h2-15H,16H2,1H3
charge 0 multiplicity 1
41 atoms
N  -0.248849 0.060587 1.868109
C  0.056335 0.009456 0.387024
C  -1.153089 0.791512 -0.157552
C  -1.714334 0.158667 2.078108
C  -2.175461 0.86044 0.816994
C  1.372556 0.749785 0.062708
C  0.05275 -1.46388 -0.120635
C  0.481431 -0.822545 2.782123
C  -1.331831 1.365248 -1.429186
C  -3.396205 1.502212 0.53629
C  2.03819 0.547184 -1.174024
C  1.214178 -2.27224 0.013207
C  1.879508 1.726816 0.953871
C  -1.133775 -2.07788 -0.600353
C  -2.55666 2.015124 -1.717462
C  -3.582475 2.082218 -0.743064
C  3.18805 1.297356 -1.506193
C  1.194763 -3.641447 -0.328424
C  3.033072 2.473384 0.627348
C  -1.156685 -3.448199 -0.944976
C  3.693448 2.262859 -0.605241
C  0.007268 -4.238439 -0.811728
H  -1.935536 0.726903 3.002867
H  -2.207367 -0.842158 2.176504
H  0.250034 -0.528054 3.822752
H  1.568724 -0.699994 2.63317
H  0.236225 -1.903629 2.664733
H  -0.535119 1.322601 -2.179431
H  -4.188874 1.558874 1.291297
H  1.663515 -0.207099 -1.875812
H  2.145331 -1.822356 0.376286
H  1.345135 1.889654 1.895799
H  -2.042989 -1.479658 -0.722162
H  -2.710967 2.474211 -2.700406
H  -4.52336 2.592122 -0.979399
H  3.689134 1.127023 -2.466123
H  2.106338 -4.240407 -0.220121
H  3.413543 3.222781 1.331227
H  -2.083159 -3.896255 -1.322555
H  4.587375 2.843214 -0.860996
H  -0.009365 -5.300192 -1.082475
