program: Gaussian 09
title: 000278167
version: EM64L-G09RevD.01
frameworkgroup: C1[X(C14H9ClFNO4S)]
method: RPBEPBE
basis: SDD
operation: Freq
keyword: #p
keyword: freq=noraman
keyword: PBEPBE/SDD
title: #p freq=noraman PBEPBE/SDD
converged: YES YES NO NO
title: Mulliken charges:
elementType: Cl S F O O O O N C C C C C C C C C C C C C C H H H H H H H H H
charge: -0.025698 1.090252 -0.342926 -0.475162 -0.474501 -0.199192 -0.198038 0.026911 0.533565 -0.122280 0.665567 -0.365007 -0.382966 -0.299417 -0.225221 -0.228965 -0.292077 -0.332754 -0.364132 0.403198 -0.382386 -0.396039 0.246789 0.248240 0.222391 0.289193 0.290869 0.243345 0.238080 0.315080 0.293282
chargesum: 0.00000
title: Mulliken charges with hydrogens summed into heavy atoms:
elementType: Cl S F O O O O N C C C C C C C C C C C C C C
charge: -0.025698 1.090252 -0.342926 -0.475162 -0.474501 -0.199192 -0.198038 0.026911 0.533565 -0.122280 0.665567 -0.118217 -0.134727 -0.077026 0.063973 0.061904 -0.048732 -0.332754 -0.126052 0.403198 -0.067307 -0.102757
polarizability: 5.52177332e+02 2.31827134e+00 2.17093314e+02 -6.55364231e+00 4.09854096e-01 8.98123439e+01
1716.lowfreq: -7.9106 -3.2574 -2.0885 0.0016 0.0020 0.0024 5.2553 22.1881 31.2088
frequency: -1.2104 22.1811 31.1389 37.4153 49.8651 60.8553 100.5859 109.7399 129.5431 140.5423 163.8313 177.1521 187.5969 193.7452 235.5982 264.1305 288.3829 319.0220 320.6037 348.0510 365.3057 387.5056 405.3624 407.0521 447.2088 457.7603 490.0977 503.3646 536.1668 539.2674 556.6936 618.2042 623.2122 652.8606 686.5397 699.3414 710.8171 741.0043 783.0841 830.8642 835.4496 836.9084 848.3957 852.7884 872.2525 908.8629 926.8285 967.3267 982.4461 985.7904 986.2416 994.2371 998.9101 1024.0566 1049.9463 1100.6894 1120.6635 1135.1242 1192.4963 1195.3634 1209.7552 1250.3244 1275.4442 1291.0956 1306.1487 1331.6831 1362.7181 1386.2133 1401.1967 1408.2464 1409.0042 1458.2540 1476.5424 1571.6290 1578.3335 1585.1436 1597.7797 1637.5274 3107.8013 3139.1428 3142.3864 3154.8422 3160.2761 3169.2972 3172.8990 3189.3753 3191.0642
redmass: 9.8998 10.0676 4.8117 10.7563 8.3779 10.4589 6.1706 10.5268 10.4669 3.3824 5.5227 10.8446 7.1125 8.8054 11.0807 8.6220 6.6995 9.8234 6.1093 11.2440 5.6948 7.7751 5.0457 4.0974 3.3049 10.2064 5.6589 3.9208 5.1711 4.9505 8.9294 7.1417 8.3700 7.0091 5.7300 9.4788 3.5138 3.2893 7.2913 1.3525 1.7979 2.6764 1.6183 14.9454 4.8485 2.1405 1.4336 1.3216 1.4174 1.8666 2.4368 14.0515 1.2096 2.9502 2.5316 2.9967 1.4033 1.4625 1.1469 2.9122 5.1694 1.6539 1.5218 1.8749 1.5828 1.3640 5.5936 6.0756 5.1491 5.4665 2.7986 2.4985 2.5525 8.0830 6.8518 5.7311 6.5796 5.1497 1.0906 1.0881 1.0894 1.0880 1.0889 1.0960 1.0976 1.0943 1.0946
irintensity: 0.1083 3.7298 0.0906 3.0912 0.0810 0.1890 1.9736 1.0826 1.8092 2.0580 0.4264 4.8202 2.4345 0.0326 4.0153 14.3926 0.6425 1.1302 2.6787 5.7625 1.9770 0.2688 21.9510 17.8352 3.9852 76.8274 1.8280 27.5158 11.3300 14.3263 186.0155 1.6984 35.5284 23.8959 14.9252 43.5556 6.3092 0.4426 28.7296 3.7268 6.2884 16.1293 73.5417 152.5301 4.4401 5.4900 22.1292 12.9456 3.3010 15.9607 7.3833 71.7885 28.8240 21.8189 67.4843 44.5670 2.4302 11.1883 2.9418 264.3042 444.2856 36.4644 7.0023 7.1052 17.0075 0.0396 58.8658 26.1508 7.3961 86.9027 29.5327 9.3201 11.0810 4.7273 2.5550 6.5579 171.6385 2.7057 10.5593 20.3724 7.8720 4.2358 5.6020 1.2494 4.4047 2.6752 8.6329
temp: 298.150 k
press: 1.00000 atm
elementType: 17 16 9 8 8 8 8 7 6 6 6 6 6 6 6 6 6 6 6 6 6 6 1 1 1 1 1 1 1 1 1
symmnumber: 1
zpe: 528753.0 jmol-1
zpe.correction: 0.201391 hartree
zpe.thermalcorrener: 0.221046 hartree
zpe.thermalcorrenthalpy: 0.221990 hartree
zpe.thermalcorrgfe: 0.150469 hartree
zpe.sumelectzpe: -1850.684012 hartree
zpe.sumelectthermal: -1850.664358 hartree
zpe.sumelectthermalent: -1850.663413 hartree
zpe.sumelectthermalfe: -1850.734934 hartree
dipole: -2.1490 -1.6252 -0.6827
dipole: 2.7795
quadrupole: -244.4767 -133.0024 -147.2648
quadrupole: -5.5503 -2.8440 0.4783
quadrupole: -69.5621 41.9123 27.6499 -5.5503 -2.8440 0.4783
hfenergy: -1850.8854035 hartree
pointgroup: C01 [X(C14H9Cl1F1N1O4S1)]
dipole: -0.8638036 0.4434306 0.5030466 debye
polarizability: 551.9136006|0.6818991|192.6542726|12.5510561|50.1924479|114.5151163 unknown
InChI: InChI=1S/C14H9ClFNO4S/c15-14-9-12(17(18)19)6-5-11(14)4-1-10-2-7-13(8-3-10)22(16,20)21/h1-9H
charge 0 multiplicity 1
31 atoms
Cl -2.453763 -2.691216 -1.362618
S  6.312129 -0.105417 0.081961
F  6.604687 0.702529 -1.566999
O  6.996962 0.856925 1.171428
O  6.73022 -1.64579 -0.102844
O  -6.940815 1.459391 0.501656
O  -7.217553 -0.58719 -0.474669
N  -6.481541 0.36518 -0.007733
C  1.671006 0.33479 0.180748
C  4.45578 0.07605 0.116113
C  -2.188155 -0.143535 -0.15695
C  2.281365 -0.820131 -0.397579
C  2.513776 1.34894 0.726621
C  0.216536 0.529883 0.246685
C  3.679325 -0.958382 -0.438009
C  3.91641 1.234501 0.698186
C  -0.736826 -0.339283 -0.220384
C  -3.090567 -1.138577 -0.646658
C  -2.786241 1.036914 0.386747
C  -5.010095 0.194037 -0.057918
C  -4.48425 -0.992473 -0.607803
C  -4.174402 1.217624 0.443224
H  1.665991 -1.618339 -0.822789
H  2.06127 2.23978 1.176579
H  -0.097033 1.469167 0.722002
H  4.153669 -1.843002 -0.873994
H  4.564817 2.008323 1.120084
H  -0.417798 -1.277609 -0.687513
H  -2.139703 1.831058 0.770664
H  -5.159227 -1.763234 -0.986796
H  -4.623273 2.122384 0.859959
