program: Gaussian 09
title: 000278197
version: EM64L-G09RevD.01
frameworkgroup: C1[X(C11H16N6O6)]
method: RPBEPBE
basis: SDD
operation: Freq
keyword: #p
keyword: freq=noraman
keyword: PBEPBE/SDD
title: #p freq=noraman PBEPBE/SDD
converged: YES YES NO NO
title: Mulliken charges:
elementType: O O O O O O N N N N N N C C C C C C C C C C C H H H H H H H H H H H H H H H H
charge: -0.271651 -0.453230 -0.445607 -0.443802 -0.245108 -0.278469 -0.244753 -0.206643 -0.094806 -0.236920 -0.543496 -0.607419 -0.090778 -0.204258 -0.144359 -0.045069 -0.355753 0.174500 0.180153 0.099239 0.170798 -0.611891 0.211772 0.294290 0.272229 0.238426 0.262111 0.207228 0.219533 0.361431 0.358364 0.245000 0.260942 0.247790 0.354773 0.329818 0.330647 0.337100 0.367871
chargesum: 0.00000
title: Mulliken charges with hydrogens summed into heavy atoms:
elementType: O O O O O O N N N N N N C C C C C C C C C C C
charge: -0.271651 -0.091799 -0.087244 -0.089030 -0.245108 -0.278469 -0.244753 -0.206643 -0.094806 -0.236920 0.116969 0.097551 0.203512 0.067971 0.094067 0.217042 0.071007 0.174500 0.180153 0.099239 0.170798 0.141841 0.211772
polarizability: 2.25915327e+02 6.09272123e+00 2.12406830e+02 -1.10232058e+01 5.96750255e+00 1.21517999e+02
1716.lowfreq: -3.6540 -0.0005 0.0001 0.0002 5.4187 7.1553 20.8305 33.4320 38.6287
frequency: 20.7564 33.4253 38.5913 58.1597 65.6342 78.4896 85.0113 97.2136 100.7576 121.9903 124.3317 158.0611 189.2068 200.7761 213.2836 222.7847 233.0676 263.7783 291.6911 298.4612 315.0875 322.3888 332.6255 350.0413 373.2868 387.6449 411.0414 423.2535 435.6542 451.6716 489.0801 503.5237 535.0125 559.2018 587.3698 609.0046 627.9521 650.9033 655.6570 684.8039 693.0973 706.1345 716.6489 733.8953 737.2211 768.9874 791.4928 823.2470 844.3855 874.6832 909.5800 936.8013 956.7500 965.7809 975.8130 1001.8498 1020.7400 1026.1257 1038.1121 1068.8818 1090.5017 1106.8846 1119.4741 1130.1688 1169.5504 1187.9955 1194.3784 1200.0200 1225.6372 1246.7007 1254.3892 1270.6041 1280.0317 1283.6850 1289.5853 1310.7092 1324.4370 1343.2126 1356.4817 1375.3923 1384.2212 1387.0628 1393.5943 1420.3256 1452.4370 1458.6927 1472.3567 1482.7582 1491.9989 1507.0321 1550.0666 1595.0442 1669.6033 1684.2978 1684.5936 3000.3245 3002.8915 3017.8067 3057.1290 3079.2390 3081.7518 3094.8348 3094.9332 3118.5003 3379.4204 3474.8759 3485.2078 3513.5092 3552.2497 3567.7720 3695.1127
redmass: 3.9671 6.7159 4.0631 2.6048 1.4093 3.0495 3.9548 2.9273 3.4945 3.5828 2.8015 3.1579 5.5533 4.0014 3.5701 6.1414 1.5959 4.8304 5.0904 5.1708 5.6480 5.0613 4.5566 3.0676 9.4858 5.1022 6.8701 7.0223 1.2811 4.4458 1.1778 3.6777 7.8335 1.1448 4.8582 7.0890 3.9449 2.0329 2.4262 7.1709 7.0694 7.5126 8.5717 7.5289 6.9319 4.5486 3.2759 4.6442 5.5828 1.7046 3.1458 5.5388 5.4264 2.5784 3.1753 3.4262 3.0101 4.2449 4.4100 3.9268 3.8473 1.9658 3.0346 1.2976 3.6610 1.3157 1.2509 1.1718 3.6120 1.4073 3.0149 1.4698 1.3221 1.1637 1.3630 1.3456 3.3608 1.3167 1.5087 1.2054 1.2966 1.5872 3.0235 2.6284 1.0900 1.8440 1.0424 1.2521 2.0795 2.7618 5.3796 2.9761 3.5070 1.8132 4.4791 1.0676 1.0328 1.0812 1.0873 1.0859 1.0887 1.0994 1.1025 1.1020 1.0441 1.0645 1.0971 1.0464 1.0658 1.0662 1.1030
irintensity: 21.4647 1.7932 31.6791 81.2388 15.2484 27.6983 6.2665 4.6305 15.7499 3.3977 86.8386 2.0122 3.1542 1.7021 1.3110 3.1597 13.3324 2.5517 9.6532 2.9575 1.6099 8.7511 8.0085 25.6697 3.4859 1.2612 10.5838 10.4597 207.5178 22.3262 157.3935 31.9272 0.6156 17.9792 11.8615 2.2685 44.6106 28.4339 37.4332 24.8814 66.3136 25.5302 17.2797 32.8860 16.1886 1.4688 39.0598 77.3806 27.4373 134.3479 7.5252 45.4090 210.7540 23.6712 50.0874 24.9664 30.0740 72.4934 11.7693 49.3790 2.2040 30.3577 12.5790 0.3151 9.1978 31.5563 8.2015 28.6680 12.5830 18.9785 54.5806 7.8563 4.9348 1.5902 18.0696 15.7654 196.2111 24.0310 28.4417 51.8024 20.9971 14.4645 14.8500 8.2454 8.1137 105.9234 17.2111 117.2401 55.2593 107.4139 15.9534 780.5692 550.4469 331.1596 225.6187 28.6127 36.6273 26.7717 10.8253 6.3815 28.3606 29.1152 19.0387 1.2885 9.5855 28.6372 11.5311 152.4204 9.1164 19.1610 72.2184
temp: 298.150 k
press: 1.00000 atm
elementType: 8 8 8 8 8 8 7 7 7 7 7 7 6 6 6 6 6 6 6 6 6 6 6 1 1 1 1 1 1 1 1 1 1 1 1 1 1 1 1
symmnumber: 1
zpe: 776378.7 jmol-1
zpe.correction: 0.295707 hartree
zpe.thermalcorrener: 0.318522 hartree
zpe.thermalcorrenthalpy: 0.319466 hartree
zpe.thermalcorrgfe: 0.242497 hartree
zpe.sumelectzpe: -1206.876684 hartree
zpe.sumelectthermal: -1206.853869 hartree
zpe.sumelectthermalent: -1206.852925 hartree
zpe.sumelectthermalfe: -1206.929894 hartree
dipole: -3.7507 -5.7143 -3.9817
dipole: 7.9104
quadrupole: -139.3091 -130.3684 -134.8309
quadrupole: 11.0625 -9.4320 6.0596
quadrupole: -4.4730 4.4678 0.0052 11.0625 -9.4320 6.0596
hfenergy: -1207.1723908 hartree
pointgroup: C01 [X(C11H16N6O6)]
dipole: -1.3505489 -1.7291457 -2.2072412 debye
polarizability: 225.5167812|9.4495901|201.4386749|-7.7604805|30.9577606|132.8846996 unknown
InChI: InChI=1S/C11H16N6O6/c1-15-4-7(14-10(12)17(13)8(4)21)16(11(15)22)9-6(20)5(19)3(2-18)23-9/h3,5-6,9,18-20H,2,12-13H2,1H3
charge 0 multiplicity 1
39 atoms
O  2.300104 0.46606 1.035077
O  3.042909 1.762189 -1.876807
O  4.42296 -0.399792 -1.30235
O  3.404039 -1.582046 2.722862
O  -0.161906 3.292282 1.102982
O  -4.347588 -0.287795 0.195063
N  0.150366 1.125631 0.088742
N  -1.944032 1.735121 0.703506
N  -0.329769 -1.11334 -0.825102
N  -2.666052 -1.68815 -0.693936
N  -3.650089 -2.690771 -0.96571
N  -1.109437 -3.196608 -1.619237
C  1.611066 1.214573 -0.017377
C  2.168165 0.693829 -1.368316
C  3.004327 -0.603731 -1.01729
C  2.693608 -0.868946 0.476139
C  3.848826 -1.371438 1.340301
C  -0.701412 0.067315 -0.235219
C  -0.613037 2.192504 0.693501
C  -2.005935 0.443921 0.140656
C  -3.112944 -0.433738 -0.068534
C  -3.056227 2.529399 1.233507
C  -1.340152 -1.979172 -1.041704
H  1.856364 2.279102 0.130974
H  1.363574 0.464869 -2.086307
H  2.699382 -1.460279 -1.637627
H  1.826004 -1.550315 0.56284
H  4.693597 -0.657636 1.289342
H  4.196569 -2.354556 0.984321
H  3.296204 1.558384 -2.812895
H  4.619413 0.563371 -1.139394
H  -3.803998 2.729357 0.448006
H  -2.634876 3.480326 1.597409
H  -3.553589 2.000544 2.063517
H  3.016994 -0.726497 3.04263
H  -4.366054 -2.293931 -1.594706
H  -4.100196 -2.966678 -0.07842
H  -0.157994 -3.452829 -1.865483
H  -1.910383 -3.816229 -1.75086
