program: Gaussian 09
title: 000278252
version: EM64L-G09RevD.01
frameworkgroup: C1[X(C25H23NO5S)]
method: RPBEPBE
basis: SDD
operation: Freq
keyword: #p
keyword: freq=noraman
keyword: PBEPBE/SDD
title: #p freq=noraman PBEPBE/SDD
converged: YES YES NO NO
title: Mulliken charges:
elementType: S O O O O O N C C C C C C C C C C C C C C C C C C C C C C C C C H H H H H H H H H H H H H H H H H H H H H H H
charge: 0.863431 -0.561175 -0.554745 -0.374647 -0.314678 -0.334491 -0.494439 -0.583189 -0.227063 -0.296350 0.463808 0.061348 -0.437940 0.480741 -0.342349 0.303134 0.108601 0.301387 -0.135814 -0.350776 0.300130 -0.453459 -0.088003 0.083437 -0.335800 -0.827260 -0.684696 -0.369469 -0.389804 -0.377936 -0.225098 -0.227202 0.265395 0.258315 0.233518 0.232221 0.343574 0.199368 0.197378 0.381735 0.242828 0.255416 0.270956 0.227977 0.290735 0.235541 0.217494 0.220523 0.217943 0.267705 0.295017 0.294443 0.240036 0.241022 0.391225
chargesum: 0.00000
title: Mulliken charges with hydrogens summed into heavy atoms:
elementType: S O O O O O N C C C C C C C C C C C C C C C C C C C C C C C C C
charge: 0.863431 -0.561175 -0.554745 0.016578 -0.314678 -0.334491 -0.112703 -0.059479 -0.227063 0.169389 0.463808 0.061348 -0.094366 0.480741 0.054397 0.303134 0.108601 0.301387 -0.135814 -0.107948 0.300130 -0.198043 -0.088003 0.083437 -0.064844 -0.073006 -0.028736 -0.101764 -0.094786 -0.083494 0.014939 0.013820
polarizability: 6.76724685e+02 -9.74484624e+00 3.74293538e+02 -3.07172433e+01 6.66113601e+00 1.71959003e+02
1716.lowfreq: -0.0018 -0.0011 0.0010 2.7145 4.5643 7.8482 12.7633 15.4643 29.3643
frequency: 12.5521 15.0534 29.3593 39.7834 44.7558 62.4698 72.7166 77.8191 85.0913 108.7304 115.0438 116.8796 122.0099 135.2315 156.7672 168.3496 180.0745 193.5711 202.0498 221.2387 223.7868 229.4147 239.9219 245.9229 252.6985 280.4366 291.0237 334.5162 338.3768 353.2049 369.3187 381.2283 388.8255 400.0470 423.5753 424.5522 428.9754 433.4232 454.3738 461.3272 482.1077 492.8369 500.0764 516.3602 559.7928 568.5990 570.8484 605.6129 627.9219 655.1998 661.2712 663.1393 699.6178 706.8606 717.9906 728.5983 747.8499 761.8763 767.4712 787.1941 789.4685 803.1745 829.3196 833.5811 841.6282 845.9949 866.4953 881.1959 893.9905 898.1619 925.8779 929.1791 932.6079 941.3297 965.6287 969.0290 980.8015 996.9966 1000.3068 1005.0261 1008.0454 1014.6379 1024.7489 1025.8071 1049.4493 1063.1204 1069.9786 1071.5513 1086.8604 1100.4175 1154.5607 1165.2176 1167.1796 1177.7370 1201.3895 1219.3335 1222.4947 1241.9490 1248.3875 1261.8704 1271.7806 1275.2367 1287.0933 1291.7084 1293.7328 1304.8039 1327.8364 1345.2400 1353.5685 1354.4264 1389.1404 1391.0240 1395.0471 1400.9202 1405.8708 1406.7636 1419.8410 1438.6130 1456.9787 1468.7982 1470.2644 1472.5451 1478.2542 1478.7076 1485.2006 1490.1000 1490.4273 1503.2726 1513.0002 1546.2803 1569.1752 1594.1624 1609.0771 1616.4184 1618.6330 1633.6456 2497.9870 2948.8630 2969.8942 2972.7107 2980.7079 2998.6399 3019.2455 3038.3503 3056.0621 3061.7531 3079.7971 3080.9826 3095.3322 3129.3814 3130.6878 3137.6231 3138.3501 3153.1177 3153.8183 3166.2881 3168.5089 3174.2718 3191.3371
redmass: 5.5145 4.6357 6.3138 3.7858 5.9982 3.0027 4.6201 2.5444 5.3728 3.4718 2.2403 3.8673 1.3852 3.2673 7.0814 5.5298 6.4322 6.8285 5.8223 4.5274 4.3222 2.2560 4.2836 1.7485 5.7288 5.7007 4.7446 5.4433 5.4871 6.0925 5.2721 5.4996 3.8599 11.0321 3.5223 5.7506 4.8171 11.1666 3.8332 5.3573 6.8861 7.7707 4.7153 6.8392 5.5908 3.8182 4.8144 6.0542 6.3991 6.6308 5.8167 6.2572 5.1633 4.0215 3.1701 4.4105 1.0720 5.8237 4.7745 1.3374 8.0609 1.6966 1.7403 1.4987 3.3696 3.8628 7.3197 2.3873 1.9482 3.9470 1.3608 1.6779 1.8039 1.3188 2.2519 2.0527 1.3305 1.3843 1.4392 1.0687 2.7980 1.3660 2.5219 3.7484 1.5137 1.2534 2.6425 2.3698 2.5191 2.2111 1.3306 2.0956 1.2438 1.2786 1.5498 1.4451 1.6602 3.3680 1.8020 1.9254 1.5572 1.2152 2.1380 3.8664 1.0662 1.3083 4.0946 1.4643 4.1668 3.6189 4.0349 5.1783 1.2046 1.1935 6.8405 1.1798 4.0568 5.1085 3.2206 1.2801 2.0442 1.0642 1.0613 1.0451 1.4250 1.7542 1.0875 4.5064 6.7555 4.9631 4.9098 2.7947 6.2690 7.1667 3.0620 2.6153 1.0759 1.0853 1.0410 1.0585 1.0364 1.0592 1.1012 1.0549 1.0926 1.1038 1.1009 1.1000 1.1002 1.1103 1.0880 1.0865 1.0911 1.0971 1.0906 1.0946 1.0888 1.0999 1.0961
irintensity: 0.3719 0.6785 0.6591 0.6066 0.5101 1.8085 2.8902 1.9526 0.0408 0.2283 0.5883 2.0658 1.8232 6.5651 0.2751 4.0985 1.4891 1.1409 2.2426 8.4863 0.2588 0.1018 5.9243 1.2936 1.9334 1.9881 2.5649 14.3625 9.6900 15.7854 1.0271 1.3848 29.5934 0.7168 2.0070 2.7141 3.4588 14.5127 18.5594 13.9149 70.1502 50.2414 2.1457 17.0823 1.8467 16.7236 9.4323 8.1548 1.0051 5.3675 0.4084 5.9912 10.8834 2.8588 20.0772 5.5704 7.8131 5.9374 4.7256 3.8466 58.1360 52.1972 17.6131 50.5256 2.5275 1.8823 11.5175 35.3884 9.0531 11.8105 5.2777 1.9537 36.8831 107.0660 8.2988 12.8586 5.0393 0.7124 1.2890 131.6225 5.5585 0.0335 25.9727 3.5403 22.0557 4.9519 1.7880 11.8550 7.4871 49.6720 12.2928 15.4263 2.6610 36.4352 0.8876 3.0797 15.4153 14.0005 22.8666 57.6988 75.9954 0.5283 150.5652 166.7020 0.2639 13.4827 712.6019 8.0607 45.3142 23.8249 100.3506 15.2245 6.1394 8.2729 51.3761 16.2578 2.6353 41.0403 7.3527 32.4821 21.5642 3.0419 2.1305 11.4598 49.7311 15.8996 20.4362 781.2003 79.2044 90.9658 13.7277 105.9360 7.0198 84.9468 128.3527 86.8399 74.0618 77.0419 32.3831 30.5306 38.7252 16.3094 10.8120 13.0678 20.2844 2.0776 52.4596 48.5714 5.3479 5.9563 15.0151 3.7778 29.1468 12.5925 12.6407 1.1369 0.9999 33.1376 2.7917
temp: 298.150 k
press: 1.00000 atm
elementType: 16 8 8 8 8 8 7 6 6 6 6 6 6 6 6 6 6 6 6 6 6 6 6 6 6 6 6 6 6 6 6 6 1 1 1 1 1 1 1 1 1 1 1 1 1 1 1 1 1 1 1 1 1 1 1
symmnumber: 1
zpe: 1105538.2 jmol-1
zpe.correction: 0.421077 hartree
zpe.thermalcorrener: 0.450610 hartree
zpe.thermalcorrenthalpy: 0.451554 hartree
zpe.thermalcorrgfe: 0.358617 hartree
zpe.sumelectzpe: -1793.019853 hartree
zpe.sumelectthermal: -1792.990321 hartree
zpe.sumelectthermalent: -1792.989377 hartree
zpe.sumelectthermalfe: -1793.082314 hartree
dipole: 0.9271 -3.1179 -5.4999
dipole: 6.3898
quadrupole: -158.6964 -195.1966 -208.0497
quadrupole: 15.3365 -29.0638 2.7625
quadrupole: 28.6178 -7.8823 -20.7354 15.3365 -29.0638 2.7625
hfenergy: -1793.4409307 hartree
pointgroup: C01 [X(C25H23N1O5S1)]
dipole: -0.4677247 -1.0612715 2.230426 debye
polarizability: 677.6280375|-9.4591717|372.7039977|-23.0763665|-18.0171612|172.6451913 unknown
InChI: InChI=1S/C25H23NO5S/c1-3-4-13-32(30,31)21-14-16(10-9-15(21)2)26-19-11-12-20(27)23-22(19)24(28)17-7-5-6-8-18(17)25(23)29/h5-12,14,26-27H,3-4,13H2,1-2H3
charge 0 multiplicity 1
55 atoms
S  -4.543267 0.081481 -1.170353
O  -3.604054 1.276913 -1.790997
O  -5.527815 -0.784042 -2.153487
O  2.995011 3.842456 0.026538
O  2.630688 -2.273684 0.270809
O  5.150658 2.632346 -0.248747
N  0.345352 -1.100977 0.438763
C  -5.659352 0.918974 0.182413
C  -3.35104 -1.080157 -0.207388
C  -6.646684 1.860922 -0.506221
C  -3.800194 -2.282754 0.38304
C  2.423736 0.13728 0.169108
C  -2.02243 -0.634731 -0.231604
C  -1.030924 -1.412313 0.424745
C  -7.573015 2.54966 0.52927
C  0.991307 0.122835 0.336477
C  3.109326 1.399866 0.056751
C  4.662704 -1.03464 -0.090506
C  3.194121 -1.109278 0.122814
C  -2.776631 -3.05313 1.003695
C  5.32877 0.22181 -0.220713
C  -1.435387 -2.633262 1.037851
C  4.555622 1.473083 -0.140953
C  2.380295 2.627731 0.133088
C  0.297178 1.381051 0.449537
C  -5.241273 -2.758185 0.381673
C  -8.578441 3.505014 -0.149704
C  0.968613 2.593779 0.350904
C  5.417903 -2.232802 -0.161637
C  6.732473 0.263822 -0.421005
C  6.810602 -2.183046 -0.362409
C  7.470474 -0.932073 -0.492651
H  -4.931107 1.430051 0.833343
H  -6.144243 0.075571 0.700785
H  -6.089996 2.62792 -1.077608
H  -7.25779 1.289304 -1.230805
H  -1.788767 0.261367 -0.816655
H  -6.959119 3.11393 1.259664
H  -8.12369 1.778932 1.10549
H  1.039331 -1.896385 0.465448
H  -3.052146 -4.003709 1.474603
H  -0.681429 -3.252638 1.536391
H  -0.775449 1.38924 0.651424
H  -5.815328 -2.303974 1.213825
H  -5.749278 -2.500981 -0.563703
H  -5.285771 -3.851431 0.519756
H  -9.218313 2.961065 -0.868895
H  -9.237661 3.985541 0.59558
H  -8.053789 4.30471 -0.704226
H  0.437403 3.544981 0.444697
H  4.886633 -3.183424 -0.057176
H  7.212678 1.24232 -0.516689
H  7.387727 -3.112144 -0.418854
H  8.553849 -0.899302 -0.648749
H  4.021026 3.640209 -0.114646
