program: Gaussian 09
title: 000278155
version: EM64L-G09RevD.01
frameworkgroup: C1[X(C12H7N5O4)]
method: RPBEPBE
basis: SDD
operation: Freq
keyword: #p
keyword: freq=noraman
keyword: PBEPBE/SDD
title: #p freq=noraman PBEPBE/SDD
converged: YES YES NO NO
title: Mulliken charges:
elementType: O O O O N N N N N C C C C C C C C C C C C H H H H H H H
charge: -0.176126 -0.185652 -0.198891 -0.193013 -0.259390 -0.000813 0.006827 0.029635 0.021912 0.378644 0.025784 0.237680 0.295583 -0.322735 -0.496656 -0.409250 0.434928 -0.382483 -0.277227 -0.161906 -0.320093 0.294524 0.330455 0.278279 0.297263 0.259551 0.238127 0.255044
chargesum: 0.00000
title: Mulliken charges with hydrogens summed into heavy atoms:
elementType: O O O O N N N N N C C C C C C C C C C C C
charge: -0.176126 -0.185652 -0.198891 -0.193013 -0.259390 -0.000813 0.006827 0.029635 0.021912 0.378644 0.025784 0.237680 0.295583 -0.028211 -0.166201 -0.130971 0.434928 -0.085220 -0.017676 0.076220 -0.065050
polarizability: 3.25633203e+02 -1.87927059e+00 1.91608016e+02 -5.12977960e+00 -1.59636845e+01 9.14168352e+01
1716.lowfreq: -7.0906 -3.3455 0.0004 0.0005 0.0009 3.6542 36.9172 50.4866 63.4492
frequency: 36.9123 50.4789 63.4361 69.5211 92.4850 133.4377 148.5957 158.5421 189.7582 223.0882 249.5979 267.4145 304.0293 328.7879 373.8524 426.1939 436.7265 446.2808 482.2070 502.6238 519.9866 572.2887 576.7641 603.1803 627.5220 638.3514 644.9849 675.0862 710.1936 711.3104 736.3407 748.8876 757.9931 781.4696 799.3434 852.6352 857.2084 867.9937 895.7417 942.7009 953.0435 971.3241 985.0628 994.1276 1012.5825 1036.7763 1064.1526 1109.6824 1119.4464 1143.3435 1184.5114 1203.2709 1209.1387 1222.1996 1252.8855 1267.4347 1302.3923 1353.7500 1361.0221 1377.6009 1383.4815 1395.9073 1402.5174 1419.6930 1430.8185 1466.1593 1493.1425 1557.1263 1587.6765 1600.3562 1611.1357 3148.6305 3156.7788 3179.1714 3181.4623 3188.3585 3195.4088 3218.7841
redmass: 8.5878 10.5479 7.4223 8.6978 8.5882 8.9407 6.1983 10.8204 7.5847 5.9783 9.7676 6.1863 8.6810 9.8108 5.6790 6.6221 4.4007 4.7880 5.6569 8.5126 4.8637 6.2499 3.6400 5.6999 6.2856 7.9353 8.0051 8.0882 8.2614 7.4667 4.9968 7.8896 12.3155 3.4402 1.2632 1.6165 1.5471 6.0524 5.6639 1.4065 1.4517 6.9253 1.3769 1.3920 4.2428 2.6252 1.9867 2.1254 3.3957 1.2970 1.8939 2.4889 4.6881 5.6673 1.4306 3.4477 2.0805 3.6582 5.0801 5.6896 5.8850 6.6085 8.4014 3.2004 4.8584 2.9450 4.3199 7.0436 9.2167 7.4630 7.3315 1.0885 1.0929 1.0893 1.0994 1.0924 1.0973 1.0978
irintensity: 0.4839 0.4095 0.9017 1.2321 4.4617 3.4248 5.6250 2.7591 1.1239 3.1447 1.8490 0.9667 1.2808 0.5462 1.6749 2.1647 0.3075 14.6266 5.0334 1.1320 5.1133 8.6832 1.8809 4.6079 4.7231 5.5740 5.5241 29.1615 6.0321 9.9760 2.0634 26.1431 16.5044 30.5315 17.4284 40.2051 40.6752 18.5654 33.0941 0.5694 22.7175 24.9121 0.8640 0.3667 23.1991 2.3872 47.6486 12.0339 1.0051 40.0679 22.0154 318.5831 196.1630 144.0481 37.9834 12.5575 4.2162 55.6172 119.8791 129.2869 27.9142 61.8882 47.1652 65.6106 46.4403 2.2953 219.8996 7.8093 26.1941 67.2060 167.3755 2.8454 7.5791 1.0306 20.7784 17.8747 3.0257 1.0903
temp: 298.150 k
press: 1.00000 atm
elementType: 8 8 8 8 7 7 7 7 7 6 6 6 6 6 6 6 6 6 6 6 6 1 1 1 1 1 1 1
symmnumber: 1
zpe: 485948.9 jmol-1
zpe.correction: 0.185088 hartree
zpe.thermalcorrener: 0.201122 hartree
zpe.thermalcorrenthalpy: 0.202066 hartree
zpe.thermalcorrgfe: 0.140399 hartree
zpe.sumelectzpe: -1034.484092 hartree
zpe.sumelectthermal: -1034.468058 hartree
zpe.sumelectthermalent: -1034.467114 hartree
zpe.sumelectthermalfe: -1034.528781 hartree
dipole: -6.9842 -3.7143 -1.4646
dipole: 8.0449
quadrupole: -118.0094 -120.5704 -122.0042
quadrupole: -0.0517 8.9895 -3.4664
quadrupole: 2.1853 -0.3757 -1.8096 -0.0517 8.9895 -3.4664
hfenergy: -1034.6691799 hartree
pointgroup: C01 [X(C12H7N5O4)]
dipole: 2.801728 -1.2326588 -0.8054388 debye
polarizability: 325.1238385|11.5050364|111.0673357|-0.4677082|42.5767895|172.4668794 unknown
InChI: InChI=1S/C12H7N5O4/c18-16(19)9-3-4-10(11(6-9)17(20)21)15-12-8(7-14-15)2-1-5-13-12/h1-7H
charge 0 multiplicity 1
28 atoms
O  -0.604447 2.035252 2.169463
O  0.697013 2.295081 0.314726
O  -5.221454 -1.380425 -0.528328
O  -5.009996 0.191234 1.11481
N  1.081286 -0.341721 -0.855752
N  1.56041 -0.662894 -2.149574
N  2.035168 -0.048991 1.394345
N  -0.211693 1.687304 0.995918
N  -4.527445 -0.550379 0.17622
C  -0.31188 -0.290715 -0.631178
C  2.13899 -0.250656 0.060635
C  3.342167 -0.48236 -0.683401
C  -0.925119 0.559305 0.336256
C  -1.13965 -1.171588 -1.377019
C  -2.29845 0.458954 0.623603
C  2.905525 -0.72497 -2.036558
C  -3.077189 -0.447806 -0.114666
C  -2.517892 -1.24906 -1.135851
C  4.564486 -0.454082 0.033669
C  4.490192 -0.222036 1.421947
C  3.224512 -0.038971 2.05591
H  -0.664483 -1.798735 -2.134849
H  -2.752381 1.096451 1.386628
H  3.500127 -0.937567 -2.92402
H  -3.161198 -1.92905 -1.699538
H  5.525725 -0.61472 -0.464359
H  5.39618 -0.187699 2.033525
H  3.164892 0.123746 3.137042
