program: Gaussian 09
title: 000278144
version: EM64L-G09RevD.01
frameworkgroup: C1[X(C12H18N2O)]
method: RPBEPBE
basis: SDD
operation: Freq
keyword: #p
keyword: freq=noraman
keyword: PBEPBE/SDD
title: #p freq=noraman PBEPBE/SDD
converged: YES YES NO NO
title: Mulliken charges:
elementType: O N N C C C C C C C C C C C C H H H H H H H H H H H H H H H H H H
charge: -0.252608 -0.417238 0.031476 -0.060772 -0.468199 0.033393 -0.699201 -0.708561 0.023086 0.370312 -0.485004 0.293597 -0.801772 -0.262451 -0.736488 0.249336 0.217323 0.218947 0.207913 0.206176 0.224293 0.220218 0.213912 0.204985 0.333195 0.248375 0.226681 0.242373 0.234295 0.195534 0.233698 0.224785 0.238390
chargesum: 0.00000
title: Mulliken charges with hydrogens summed into heavy atoms:
elementType: O N N C C C C C C C C C C C C
charge: -0.252608 -0.084044 0.031476 0.188564 -0.031930 0.033393 -0.060819 -0.069445 0.023086 0.370312 -0.236628 0.293597 -0.098423 -0.066917 -0.039614
polarizability: 2.50046175e+02 -3.26107042e+00 1.46790859e+02 -1.01780176e+01 6.56133929e+00 9.59829500e+01
1716.lowfreq: -6.3221 -0.0003 0.0005 0.0009 4.5331 8.7323 29.4218 38.8922 44.9395
frequency: 29.3900 38.8150 44.5955 62.4202 91.9870 117.2221 126.5752 151.8631 158.9195 208.2368 228.7729 234.0787 260.9583 288.5071 322.8600 325.2621 353.6316 387.0778 403.9718 417.9796 452.9507 490.0329 532.3293 557.0409 583.5150 652.3219 674.4902 728.5383 750.7341 788.4567 824.6485 836.4786 856.8744 879.3505 883.1105 919.3257 939.8724 958.6978 982.7942 1017.1057 1037.2028 1043.5342 1054.9002 1074.0680 1123.6881 1128.1607 1150.4244 1170.3795 1207.6225 1232.1482 1278.0621 1282.1880 1294.9388 1321.6957 1341.6976 1348.0859 1361.7288 1376.4578 1393.0955 1393.9584 1405.8730 1431.2636 1444.5560 1460.9874 1465.3082 1466.4498 1470.3527 1473.3534 1480.4829 1481.3847 1483.9701 1496.2340 1550.2842 1611.6182 1655.0187 2966.8061 2970.7170 2971.4175 2985.0700 2989.0229 2999.6882 3037.5975 3058.8526 3060.8281 3061.9117 3070.5304 3071.9578 3072.2186 3075.4055 3103.7760 3114.3313 3185.7061 3502.9634
redmass: 2.7701 3.3233 3.0868 3.5684 1.1198 3.5267 1.8613 4.6631 1.4379 1.0813 1.2806 2.8176 2.9993 2.3916 3.8636 2.9977 2.6702 3.1632 3.4488 2.1762 4.1448 3.2361 4.0797 7.1404 4.1585 3.5509 4.4081 2.7858 1.8864 2.7112 3.3270 1.2683 1.4879 1.8322 2.3251 1.2219 1.9478 1.4521 2.2445 1.8962 1.4868 1.5525 1.8557 2.0671 2.6031 2.7187 3.0694 1.8292 2.0531 2.6634 1.8788 1.9198 1.8958 1.3366 1.4574 1.4583 1.3954 1.2145 1.3109 1.2335 1.2107 1.7394 1.7627 1.0485 1.0704 1.0496 1.0558 1.0486 1.1092 1.0559 1.0783 5.4478 4.0619 5.5191 5.5978 1.0354 1.0393 1.0360 1.0402 1.0599 1.0832 1.0962 1.0994 1.0966 1.1014 1.0996 1.0992 1.0878 1.0987 1.0969 1.0951 1.0918 1.0761
irintensity: 0.1674 0.5632 1.1456 0.5566 1.1171 0.0443 0.5983 3.9770 1.3676 0.1687 0.3725 1.1806 1.3288 2.7597 2.8193 1.3470 0.7628 1.8669 0.9496 1.4886 0.1525 6.4252 10.6006 5.5986 1.9507 2.9656 4.4663 13.0008 29.2207 27.5762 14.0098 62.9945 4.0905 1.1530 1.6701 5.0060 4.3226 0.1010 1.5377 29.5171 0.0346 8.9915 30.9276 1.9270 7.4831 3.0509 3.5062 45.1000 12.8910 23.7549 14.3792 11.1601 34.7537 2.8654 7.1157 1.6323 2.2380 17.8063 2.8288 20.7303 15.6946 15.2338 2.8841 6.0593 14.8273 0.4247 6.3542 23.0515 21.2064 8.5371 18.0994 4.8265 84.7960 369.5672 21.4364 44.2510 37.2620 29.4116 17.6647 20.4559 3.5384 17.2556 6.7918 16.1955 11.6209 37.8283 60.9043 16.7656 70.0699 26.1639 42.5118 17.0881 25.0512
temp: 298.150 k
press: 1.00000 atm
elementType: 8 7 7 6 6 6 6 6 6 6 6 6 6 6 6 1 1 1 1 1 1 1 1 1 1 1 1 1 1 1 1 1 1
symmnumber: 1
zpe: 728835.4 jmol-1
zpe.correction: 0.277599 hartree
zpe.thermalcorrener: 0.294296 hartree
zpe.thermalcorrenthalpy: 0.295240 hartree
zpe.thermalcorrgfe: 0.232331 hartree
zpe.sumelectzpe: -651.656183 hartree
zpe.sumelectthermal: -651.639486 hartree
zpe.sumelectthermalent: -651.638542 hartree
zpe.sumelectthermalfe: -651.701451 hartree
dipole: -5.0240 -1.0098 0.7758
dipole: 5.1829
quadrupole: -74.2178 -97.3047 -93.1061
quadrupole: -3.5087 -1.3039 -0.7997
quadrupole: 13.9917 -9.0952 -4.8965 -3.5087 -1.3039 -0.7997
hfenergy: -651.9337814 hartree
pointgroup: C01 [X(C12H18N2O1)]
dipole: -1.9673057 0.3433277 -0.4120525 debye
polarizability: 249.5128114|4.8761576|147.5535368|13.1646169|-1.776507|95.7536355 unknown
InChI: InChI=1S/C12H18N2O/c1-5-9(4)11-7-13-10(6-8(2)3)12(15)14-11/h5,7-8,14H,6H2,1-4H3
charge 0 multiplicity 1
33 atoms
O  1.08594 -2.118178 0.393534
N  -0.826079 -0.803587 0.109417
N  0.614438 1.498923 0.641005
C  3.596918 -0.054144 -0.325722
C  2.732007 0.267046 0.938666
C  1.252763 0.319249 0.661801
C  3.485521 1.063714 -1.387322
C  5.068306 -0.270478 0.096562
C  0.555344 -0.962877 0.397031
C  -1.513416 0.41029 0.098029
C  -0.744115 1.547342 0.366823
C  -2.970017 0.436406 -0.19142
C  -3.540627 1.784033 -0.601109
C  -3.728511 -0.700596 -0.064338
C  -5.203754 -0.871115 -0.326046
H  3.215419 -1.00135 -0.75464
H  2.927147 -0.523975 1.688925
H  3.041595 1.242566 1.355592
H  4.077333 0.808056 -2.286142
H  3.868362 2.022668 -0.988017
H  2.43927 1.229451 -1.701827
H  5.161514 -1.107597 0.813004
H  5.699998 -0.50109 -0.781455
H  5.477735 0.639561 0.576902
H  -1.31406 -1.671646 -0.134599
H  -1.198871 2.538663 0.386274
H  -4.588611 1.702609 -0.926439
H  -2.959254 2.228852 -1.428724
H  -3.514361 2.500939 0.241693
H  -3.244887 -1.616829 0.310975
H  -5.37747 -1.714375 -1.022671
H  -5.681257 0.024984 -0.752739
H  -5.73792 -1.125214 0.610981
