program: Gaussian 09
title: 000278142
version: EM64L-G09RevD.01
frameworkgroup: C1[X(C12H20N2O)]
method: RPBEPBE
basis: SDD
operation: Freq
keyword: #p
keyword: freq=noraman
keyword: PBEPBE/SDD
title: #p freq=noraman PBEPBE/SDD
converged: YES YES NO NO
title: Mulliken charges:
elementType: O N N C C C C C C C C C C C C H H H H H H H H H H H H H H H H H H H H
charge: -0.253811 -0.408207 0.026193 -0.223536 -0.060374 -0.465229 0.535415 -0.367376 0.029767 -0.703677 0.028927 -0.538063 -0.699449 -0.708405 -0.681418 0.223233 0.249702 0.216380 0.218594 0.187675 0.215902 0.230062 0.200258 0.237225 0.325509 0.247237 0.207993 0.206871 0.221804 0.219566 0.213841 0.204738 0.210604 0.230570 0.221479
chargesum: 0.00000
title: Mulliken charges with hydrogens summed into heavy atoms:
elementType: O N N C C C C C C C C C C C C
charge: -0.253811 -0.082698 0.026193 -0.000302 0.189328 -0.030255 0.535415 0.036201 0.029767 -0.036131 0.028927 -0.290825 -0.062781 -0.070261 -0.018766
polarizability: 2.04242662e+02 -6.24192838e+00 1.22691473e+02 -5.84142108e+00 1.11372991e+01 1.27654107e+02
1716.lowfreq: -29.5920 -15.7170 -4.3268 0.0004 0.0006 0.0007 6.0895 25.9805 34.8237
frequency: -25.3986 23.4667 34.5689 60.6947 83.1698 123.9649 146.2033 164.8709 194.9502 197.7267 213.9448 218.9616 237.6812 255.6184 284.5266 304.5021 341.2326 371.8314 406.6843 436.0162 457.8586 466.8455 491.4803 556.3968 564.7585 659.6629 673.8666 728.2670 755.3007 784.1272 801.1519 824.3345 837.6043 853.9818 879.3915 913.2576 936.6710 955.7662 958.5802 978.2905 1011.8508 1026.5275 1051.3321 1079.8184 1095.6036 1123.0140 1136.8472 1142.5083 1168.7533 1188.6682 1214.6247 1240.8573 1245.8946 1276.6475 1280.0077 1289.9440 1315.0012 1324.6137 1330.1188 1341.1837 1363.9717 1372.9224 1391.2091 1393.8332 1395.8727 1430.3837 1443.5413 1464.3210 1465.7201 1468.0711 1477.0977 1477.6226 1478.6027 1479.6764 1482.2347 1483.0557 1502.7074 1575.6088 1614.6931 2965.2921 2966.2868 2970.1308 2978.8362 2981.3692 2986.3311 2998.0859 3002.6155 3025.9529 3057.5979 3059.9539 3068.8095 3070.9718 3071.1861 3073.3042 3076.6393 3082.5964 3090.4426 3165.0479 3491.4829
redmass: 2.4369 3.6224 3.4812 3.6805 2.9121 2.2608 3.5672 3.2820 1.1519 2.4924 1.0497 1.1542 1.3376 3.0900 2.4288 3.0303 3.0860 2.5073 1.9771 3.6464 3.4246 3.9483 4.6635 7.3400 3.1647 4.8695 4.5964 2.3560 1.7412 2.2112 1.4632 3.3795 2.0381 1.4545 1.6155 1.2088 1.9735 1.3987 1.4648 2.0728 1.9100 2.7931 2.1113 1.7336 2.5102 2.4274 2.6618 2.5427 1.8557 2.8482 1.8697 1.6418 1.2912 1.6793 1.2970 1.7499 1.3927 1.3366 1.4781 1.4783 1.5612 1.2159 1.2174 1.1991 1.2055 1.3775 2.0257 1.0478 1.0640 1.0556 1.0879 1.0448 1.0529 1.0461 1.0631 1.0625 6.8447 4.4142 5.9901 1.0354 1.0624 1.0360 1.0372 1.0364 1.0599 1.0835 1.0835 1.0985 1.0996 1.1014 1.0999 1.0990 1.0982 1.0987 1.0997 1.0998 1.1006 1.0925 1.0767
irintensity: 0.0130 0.3535 0.8545 0.7477 1.2260 0.3372 3.0122 2.3182 0.0636 0.4365 0.0321 0.4385 0.3166 0.6594 2.6310 2.5191 1.4164 0.8776 1.1017 0.6810 1.6867 0.3160 7.1448 7.1715 9.0865 4.0879 2.9288 22.1962 31.8442 29.2582 5.4009 7.9448 3.2861 23.0438 3.2688 4.7940 3.1400 4.6340 0.3581 12.2785 6.2917 2.2124 21.4400 4.5251 4.3186 6.6498 2.4962 7.1628 38.5267 13.9726 4.5458 9.9399 1.9526 8.6277 1.9566 43.3557 7.5974 1.7512 9.3011 6.8289 0.4038 17.1422 12.5947 0.9970 24.5680 11.0871 3.4210 0.5438 4.1370 6.8417 3.2160 4.8124 5.3353 18.8040 4.1775 23.6351 6.5905 134.4925 319.7440 42.3276 26.2066 31.2682 34.3682 16.7952 20.5560 3.3194 13.3211 24.5841 7.4046 6.8415 26.4488 82.7688 17.7815 70.5874 68.2754 46.7465 34.8634 17.5898 29.0540
temp: 298.150 k
press: 1.00000 atm
elementType: 8 7 7 6 6 6 6 6 6 6 6 6 6 6 6 1 1 1 1 1 1 1 1 1 1 1 1 1 1 1 1 1 1 1 1
symmnumber: 1
zpe: 789571.8 jmol-1
zpe.correction: 0.300732 hartree
zpe.thermalcorrener: 0.316876 hartree
zpe.thermalcorrenthalpy: 0.317821 hartree
zpe.thermalcorrgfe: 0.256577 hartree
zpe.sumelectzpe: -652.845554 hartree
zpe.sumelectthermal: -652.829409 hartree
zpe.sumelectthermalent: -652.828465 hartree
zpe.sumelectthermalfe: -652.889709 hartree
dipole: -4.6906 1.0291 0.2090
dipole: 4.8067
quadrupole: -79.8083 -95.9228 -97.9350
quadrupole: 2.4033 1.7830 -4.0793
quadrupole: 11.4137 -4.7008 -6.7130 2.4033 1.7830 -4.0793
hfenergy: -653.1462858 hartree
pointgroup: C01[X(C12H20N2O1)]
dipole: -1.8459317 0.4084137 0.0451269 debye
polarizability: 204.1887877|-6.6827796|125.4876648|-5.6376568|11.4460609|124.9117897 unknown
InChI: InChI=1S/C12H20N2O/c1-5-9(4)11-7-13-10(6-8(2)3)12(15)14-11/h7-9,14H,5-6H2,1-4H3
charge 0 multiplicity 1
35 atoms
O  0.977053 -1.782297 -1.333702
N  -0.968493 -0.849317 -0.426847
N  0.500585 0.423705 1.546311
C  -3.163295 0.035698 0.386495
C  3.389086 0.320657 -0.447573
C  2.647296 -0.446066 0.696714
C  -1.652198 -0.074612 0.503198
C  -3.599305 0.733801 -0.939512
C  1.146628 -0.321636 0.638346
C  -3.850223 -1.34885 0.541538
C  0.440477 -1.045368 -0.448132
C  -0.882626 0.54705 1.480184
C  3.149623 1.844882 -0.355641
C  4.899137 -0.00543 -0.392555
C  -3.064266 2.172426 -1.091489
H  -3.490811 0.679499 1.225822
H  2.987337 -0.052363 -1.410065
H  2.920563 -1.516504 0.616552
H  2.987362 -0.062119 1.675818
H  -3.27776 0.11967 -1.806744
H  -4.706629 0.742168 -0.966905
H  -4.94827 -1.228604 0.552517
H  -3.601781 -2.027116 -0.29732
H  -3.547191 -1.845459 1.479947
H  -1.482692 -1.338072 -1.168329
H  -1.354242 1.168868 2.244884
H  3.66147 2.371267 -1.183032
H  3.541402 2.246362 0.598871
H  2.074443 2.09614 -0.40404
H  5.079445 -1.090939 -0.502233
H  5.444656 0.514088 -1.202247
H  5.33654 0.319512 0.571594
H  -3.402907 2.811413 -0.254581
H  -1.959616 2.194591 -1.10278
H  -3.421994 2.628853 -2.031761
