program: Gaussian 09
title: 000278165
version: EM64L-G09RevD.01
frameworkgroup: C1[X(C11H10ClNO6)]
method: RPBEPBE
basis: SDD
operation: Freq
keyword: #p
keyword: freq=noraman
keyword: PBEPBE/SDD
title: #p freq=noraman PBEPBE/SDD
converged: YES YES NO NO
title: Mulliken charges:
elementType: Cl O O O O O O N C C C C C C C C C C C H H H H H H H H H H
charge: 0.004996 -0.246820 -0.235727 -0.220095 -0.233947 -0.195201 -0.195582 0.027956 0.651452 -0.158121 -0.279675 -0.407832 0.403768 -0.363693 -0.375462 0.311560 0.315049 -0.749362 -0.746577 0.292689 0.264388 0.311858 0.294445 0.249666 0.259719 0.255679 0.260288 0.255110 0.249469
chargesum: 0.00000
title: Mulliken charges with hydrogens summed into heavy atoms:
elementType: Cl O O O O O O N C C C C C C C C C C C
charge: 0.004996 -0.246820 -0.235727 -0.220095 -0.233947 -0.195201 -0.195582 0.027956 0.651452 0.134569 -0.279675 -0.143444 0.403768 -0.051835 -0.081017 0.311560 0.315049 0.015703 0.018291
polarizability: 2.17297957e+02 4.48354822e+00 1.36466558e+02 -8.03429752e+00 -2.77987030e+01 1.33997350e+02
1716.lowfreq: -7.2962 -3.2817 0.0008 0.0019 0.0020 1.6807 18.7628 25.3019 40.7367
frequency: 18.4011 25.2965 40.7326 47.8826 57.0931 57.8308 64.3293 77.9314 80.9083 112.6577 163.7649 165.5615 176.6519 199.4180 218.4984 235.8049 314.9612 329.7928 332.6217 386.1488 426.2027 436.6559 473.1154 516.1196 531.4445 541.4500 561.0007 564.5170 595.6313 627.1742 656.4218 693.5004 699.4191 733.0582 787.6375 821.9175 852.4658 862.9597 875.5615 909.1016 923.2851 972.4760 984.6645 986.5389 1015.0496 1042.2929 1043.5686 1043.7541 1101.3679 1143.5867 1170.9793 1191.3530 1209.4711 1219.8590 1252.9013 1322.9606 1344.2632 1376.0060 1385.3252 1386.0765 1388.3875 1416.3983 1450.6041 1451.6280 1452.0258 1453.0852 1468.3445 1588.0890 1603.0585 1661.7858 1677.5864 3008.8040 3009.5838 3044.1920 3098.5579 3100.5625 3145.2361 3146.6144 3155.7948 3189.0498 3193.5162
redmass: 7.3199 8.7135 6.5697 1.5689 2.4968 6.9328 3.3941 1.4215 2.3472 6.0457 9.5525 8.0699 10.0701 7.8921 6.8816 7.1647 4.4408 9.7928 5.1560 9.6560 3.4567 6.4072 4.2446 7.4817 4.5396 4.4200 3.4358 3.3795 6.2362 5.5937 7.1278 6.4716 7.9691 4.5354 6.1832 3.5935 2.9032 3.6255 5.5413 6.0758 1.4544 2.8668 1.4821 1.8542 3.2172 1.6831 1.8230 2.3156 3.7950 1.3301 2.9826 3.8886 3.9863 3.0541 1.4328 1.2506 1.9413 4.0039 1.2565 1.2941 6.4420 3.1553 1.0512 1.0562 1.0558 1.0517 2.6991 8.6272 7.1016 9.7153 10.0944 1.0378 1.0374 1.0855 1.0961 1.0953 1.1020 1.1016 1.0911 1.0928 1.0955
irintensity: 0.5690 0.0475 1.9309 2.0893 1.9092 0.6376 2.6045 0.8681 1.3688 3.3721 1.1098 0.8206 5.3394 0.1475 5.3591 2.3567 5.1880 1.1002 1.6637 5.1817 2.2167 21.9518 19.7306 3.3682 2.4343 7.8559 1.5848 11.1392 6.2128 5.4888 1.8534 21.8063 25.5264 2.1160 22.6587 38.4580 126.8728 50.0834 171.7872 197.9991 14.5807 100.8667 11.2819 13.4112 127.3309 7.7093 37.9726 30.1561 48.3762 14.9508 301.7740 560.2299 57.0138 57.8681 10.0445 6.5923 1.8928 51.8207 57.4398 72.0166 72.9385 44.0059 23.5723 34.4815 11.7271 16.7203 21.4664 6.1016 2.7749 106.8024 244.2488 0.5251 0.3348 6.0477 4.4373 4.5229 7.3925 8.6457 1.7140 8.4382 4.0503
temp: 298.150 k
press: 1.00000 atm
elementType: 17 8 8 8 8 8 8 7 6 6 6 6 6 6 6 6 6 6 6 1 1 1 1 1 1 1 1 1 1
symmnumber: 1
zpe: 520915.8 jmol-1
zpe.correction: 0.198406 hartree
zpe.thermalcorrener: 0.217813 hartree
zpe.thermalcorrenthalpy: 0.218758 hartree
zpe.thermalcorrgfe: 0.146323 hartree
zpe.sumelectzpe: -1389.853404 hartree
zpe.sumelectthermal: -1389.833997 hartree
zpe.sumelectthermalent: -1389.833052 hartree
zpe.sumelectthermalfe: -1389.905487 hartree
dipole: -4.0695 -1.4200 0.6106
dipole: 4.3531
quadrupole: -140.3815 -111.4814 -111.8320
quadrupole: 6.8587 -7.2448 8.0731
quadrupole: -19.1499 9.7502 9.3997 6.8587 -7.2448 8.0731
hfenergy: -1390.05181 hartree
pointgroup: C01 [X(C11H10Cl1N1O6)]
dipole: -1.6364055 0.2749651 -0.4239747 debye
polarizability: 216.3671317|8.9815966|119.4735206|11.8182487|-21.239828|151.921212 unknown
InChI: InChI=1S/C11H10ClNO6/c1-6(14)18-11(19-7(2)15)9-4-3-8(13(16)17)5-10(9)12/h3-5,11H,1-2H3
charge 0 multiplicity 1
29 atoms
Cl -0.072149 0.925761 -2.478528
O  -1.998494 1.217039 -0.03621
O  -1.829543 -1.07313 -0.557005
O  -3.924029 0.482197 1.075741
O  -1.667911 -2.60756 1.201919
O  5.106164 0.327062 1.212723
O  4.98346 0.980844 -0.969878
N  4.446853 0.591511 0.13642
C  0.164946 0.165396 0.23595
C  -1.331073 -0.015235 0.359786
C  0.831977 0.57767 -0.947749
C  0.951302 -0.120808 1.380936
C  2.966814 0.437512 0.176648
C  2.229462 0.72211 -0.990765
C  2.352298 0.010856 1.37072
C  -3.357191 1.342528 0.377038
C  -2.024341 -2.346996 0.034771
C  -3.935077 2.622042 -0.17043
C  -2.702769 -3.272034 -0.943709
H  -1.620595 -0.301476 1.387233
H  0.446966 -0.464014 2.289923
H  2.746916 1.043411 -1.897752
H  2.962236 -0.207842 2.249922
H  -4.92261 2.806689 0.275555
H  -4.037287 2.539131 -1.267272
H  -3.258024 3.468732 0.030464
H  -3.775371 -3.013044 -1.0051
H  -2.274315 -3.153754 -1.952019
H  -2.605115 -4.312397 -0.601732
