program: Gaussian 09
title: 000278132
version: EM64L-G09RevD.01
frameworkgroup: C1[X(C13H16)]
method: RPBEPBE
basis: SDD
operation: Freq
keyword: #p
keyword: freq=noraman
keyword: PBEPBE/SDD
title: #p freq=noraman PBEPBE/SDD
converged: YES YES NO NO
title: Mulliken charges:
elementType: C C C C C C C C C C C C C H H H H H H H H H H H H H H H H
charge: -0.382475 -0.388631 -0.380260 -0.572155 -0.459242 0.368267 -0.361335 0.306285 -0.399841 -0.409837 -0.231983 -0.237690 -0.246686 0.183840 0.201762 0.206652 0.198227 0.198060 0.207566 0.222752 0.205386 0.199713 0.199516 0.228300 0.238926 0.232742 0.222735 0.222196 0.227208
chargesum: 0.00000
title: Mulliken charges with hydrogens summed into heavy atoms:
elementType: C C C C C C C C C C C C C
charge: 0.003128 0.016248 0.025366 -0.144016 -0.060013 0.368267 -0.133035 0.306285 -0.160915 -0.177095 -0.009248 -0.015494 -0.019477
polarizability: 1.95234604e+02 -9.20114534e+00 1.37189710e+02 -4.06144777e+00 2.90203388e+00 8.29067855e+01
1716.lowfreq: -16.0267 -0.0007 -0.0007 -0.0003 7.5662 11.1439 50.2991 68.7762 109.7448
frequency: 50.1983 68.6794 109.7265 177.6687 210.3788 235.6774 301.3526 322.8014 326.8998 371.2944 406.9238 444.2674 479.0243 510.5368 579.8063 616.7266 639.2255 701.8992 709.1848 761.7901 767.3674 816.4882 845.9122 848.4514 855.8154 887.7375 912.8487 923.9911 961.8526 972.3996 973.5449 987.7902 991.1181 1027.6907 1048.5544 1067.7219 1073.3188 1091.9866 1126.6537 1141.7515 1171.5809 1191.4434 1194.5885 1212.5555 1256.2421 1257.2565 1284.6628 1306.6156 1315.1163 1320.0303 1332.5663 1352.4523 1355.9022 1358.4705 1377.4674 1433.5567 1460.1451 1461.5008 1464.7618 1465.9907 1479.6821 1486.2466 1579.2094 1608.8935 1647.5255 2943.3460 2953.1518 2960.0288 2969.2357 2970.9444 3012.0334 3026.5004 3032.1851 3036.1543 3042.8064 3106.1840 3119.0134 3124.3966 3138.5560 3145.9267 3162.5077
redmass: 3.4155 3.5794 3.7428 2.5729 2.2468 3.6476 3.8919 2.5811 1.8151 3.8563 2.8446 2.5164 1.7253 3.0276 2.9632 5.9932 3.0537 1.7544 2.8665 1.8496 2.6072 1.5075 1.5541 1.2643 1.7247 2.3171 1.7099 2.1513 2.2946 1.5582 1.6907 4.4992 1.3669 2.2327 1.9239 2.0671 1.8410 1.6668 2.0480 1.4847 1.0511 1.1421 1.1238 1.2957 1.5381 1.2417 1.6480 1.2695 1.3717 1.3416 1.4205 1.4270 1.5446 1.6170 4.9250 2.2935 1.0886 1.0871 1.1177 1.0921 1.3559 1.5877 5.7412 6.0355 7.1720 1.0666 1.0612 1.0670 1.0609 1.0632 1.0969 1.1021 1.0931 1.1019 1.0933 1.0906 1.0842 1.0870 1.0918 1.0961 1.1015
irintensity: 0.3000 0.2615 0.3589 0.4059 0.1763 0.1088 0.3947 0.7885 0.5343 0.4257 0.0137 0.8095 0.1138 8.1958 6.4440 0.4934 1.8480 44.8825 1.8691 63.5531 4.7900 4.7198 6.7517 3.9597 16.8610 3.1229 2.0810 0.5359 15.6360 0.5179 2.6734 0.0251 0.0677 5.1835 1.0737 0.5599 3.7127 4.5061 0.9588 0.3524 0.0304 0.6663 0.1677 3.3627 0.2727 1.1769 4.5531 4.4863 0.3347 0.7986 0.5346 3.7571 0.8577 2.3387 2.1992 5.1900 7.8746 5.5129 8.5373 6.3278 27.9583 15.3252 2.0364 12.9493 2.7337 44.4138 28.8844 18.1894 41.2150 45.9683 80.6607 23.3179 62.4022 99.8992 24.2873 27.9581 5.5246 0.5496 18.2982 46.7166 24.0023
temp: 298.150 k
press: 1.00000 atm
elementType: 6 6 6 6 6 6 6 6 6 6 6 6 6 1 1 1 1 1 1 1 1 1 1 1 1 1 1 1 1
symmnumber: 1
zpe: 660724.4 jmol-1
zpe.correction: 0.251657 hartree
zpe.thermalcorrener: 0.262961 hartree
zpe.thermalcorrenthalpy: 0.263905 hartree
zpe.thermalcorrgfe: 0.214329 hartree
zpe.sumelectzpe: -504.008338 hartree
zpe.sumelectthermal: -503.997034 hartree
zpe.sumelectthermalent: -503.996090 hartree
zpe.sumelectthermalfe: -504.045665 hartree
dipole: -0.7715 -0.1584 0.0117
dipole: 0.7877
quadrupole: -72.3936 -73.0490 -82.2965
quadrupole: -0.0056 -1.3511 0.5995
quadrupole: 3.5194 2.8640 -6.3835 -0.0056 -1.3511 0.5995
hfenergy: -504.2599943 hartree
pointgroup: C01 [X(C13H16)]
dipole: 0.3040112 -0.0601827 0.0010976 debye
polarizability: 195.0768141|9.160833|136.1632874|-5.175439|-8.4304972|84.0909988 unknown
InChI: InChI=1S/C13H16/c1-2-5-9-12(8-4-1)13-10-6-3-7-11-13/h3,6-8,10-11H,1-2,4-5,9H2
charge 0 multiplicity 1
29 atoms
C  3.580342 -0.797328 0.191041
C  2.256005 -1.600234 0.148987
C  3.459698 0.675159 0.651772
C  1.206415 -1.052653 -0.859477
C  2.579766 1.565769 -0.274804
C  0.432441 0.175071 -0.373947
C  1.08614 1.34872 -0.111052
C  -1.042588 0.05667 -0.166075
C  -1.913574 1.161027 -0.398498
C  -1.628148 -1.163905 0.275928
C  -3.302683 1.055926 -0.177953
C  -3.018397 -1.270992 0.498253
C  -3.865152 -0.161266 0.274545
H  4.033226 -0.814427 -0.823316
H  4.293747 -1.322001 0.858457
H  1.808263 -1.636854 1.162132
H  2.500134 -2.645388 -0.129861
H  4.478749 1.110266 0.693331
H  3.053024 0.714699 1.681521
H  0.49806 -1.857258 -1.126705
H  1.737555 -0.792478 -1.800176
H  2.882702 1.371873 -1.327541
H  2.811858 2.628371 -0.074667
H  0.510172 2.192474 0.293129
H  -1.496732 2.098062 -0.784771
H  -0.988313 -2.031347 0.474682
H  -3.950128 1.918676 -0.373242
H  -3.439797 -2.219989 0.849452
H  -4.944887 -0.244942 0.440856
