program: Gaussian 09
title: 000278143
version: EM64L-G09RevD.01
frameworkgroup: C1[X(C12H20N2O)]
method: RPBEPBE
basis: SDD
operation: Freq
keyword: #p
keyword: freq=noraman
keyword: PBEPBE/SDD
title: #p freq=noraman PBEPBE/SDD
converged: YES YES NO NO
title: Mulliken charges:
elementType: O N N C C C C C C C C C C C C H H H H H H H H H H H H H H H H H H H H
charge: -0.255725 -0.404208 0.028392 -0.036066 -0.060802 -0.560306 -0.466003 0.505174 0.030226 -0.716343 -0.696105 -0.698988 -0.707699 0.038650 -0.522344 0.225677 0.245990 0.231256 0.211752 0.217761 0.218090 0.226232 0.199172 0.237532 0.217031 0.224008 0.208445 0.207273 0.205845 0.225369 0.220804 0.213368 0.204962 0.333310 0.248269
chargesum: 0.00000
title: Mulliken charges with hydrogens summed into heavy atoms:
elementType: O N N C C C C C C C C C C C C
charge: -0.255725 -0.070898 0.028392 0.189611 0.185188 -0.117298 -0.030152 0.505174 0.030226 -0.053407 -0.046622 -0.060501 -0.068564 0.038650 -0.274075
polarizability: 2.10661303e+02 9.94248384e+00 1.35446725e+02 3.55733653e+00 8.38884686e+00 1.11593934e+02
1716.lowfreq: -14.0165 -4.8716 -0.3068 -0.0003 0.0001 0.0006 23.2700 35.6533 41.5657
frequency: 22.7662 35.5768 41.5581 53.8784 68.9975 102.5822 149.2261 194.8949 208.5983 223.1774 233.1197 241.1937 264.9554 272.0275 292.4845 319.9433 339.2465 374.0950 402.5937 411.6160 445.6436 455.3152 503.7951 545.9309 557.9581 646.0802 710.0278 736.5582 769.8938 794.1849 806.3494 826.5722 852.5601 869.2892 882.6515 918.7226 919.3382 939.8334 942.0203 958.9463 959.3531 1008.9408 1050.3240 1093.2172 1124.0986 1126.6847 1133.0099 1169.3051 1171.6603 1185.5282 1210.4791 1220.5533 1244.6885 1277.3521 1278.5548 1292.4541 1314.2563 1325.4230 1333.2847 1340.4513 1353.8640 1377.2411 1381.3326 1394.5086 1399.2321 1430.9768 1444.2538 1460.0248 1465.4242 1469.5513 1469.8075 1473.4723 1480.7206 1483.9100 1485.0452 1490.8665 1501.7699 1576.4268 1614.0497 2966.8073 2967.2462 2967.5274 2971.0253 2972.1774 2985.4992 2989.0660 2996.7299 3047.1211 3059.1377 3060.3620 3061.5349 3068.9821 3070.4093 3072.1020 3075.1820 3075.7869 3079.7937 3164.9554 3494.2224
redmass: 2.8633 3.6159 3.0627 3.3195 3.1081 4.2461 4.5922 1.0820 1.6767 1.5930 1.1877 1.4323 2.6773 1.9758 2.6876 2.5899 2.5081 2.2337 1.9904 1.9619 4.1232 3.7281 4.0255 4.4361 7.2367 5.7374 4.8189 2.6551 1.7050 2.9741 2.6364 3.4340 1.5337 1.5447 1.5320 1.2035 1.2125 1.9628 1.9811 1.4585 1.4725 3.6510 2.0314 1.4734 2.5785 2.3812 3.0503 1.8826 1.8195 3.2260 1.8018 1.5634 1.5740 1.6847 1.2985 1.6952 1.3881 1.3141 1.5065 1.4745 1.5165 1.2140 1.2119 1.2152 1.2150 1.6483 1.7924 1.0941 1.0460 1.0563 1.0534 1.0544 1.0571 1.0568 1.0636 1.0636 6.8389 4.3402 6.1888 1.0357 1.0502 1.0533 1.0360 1.0381 1.0780 1.0615 1.0813 1.0980 1.0994 1.0980 1.1015 1.0985 1.0995 1.0997 1.0989 1.0998 1.0991 1.0926 1.0772
irintensity: 0.1006 0.8730 0.0952 0.0288 1.2573 2.4925 4.4959 0.1232 0.2802 0.0446 0.2713 0.0165 0.4698 0.4540 4.5436 1.3842 1.3474 0.3183 0.2966 1.7031 0.7101 1.6165 12.0910 0.6612 6.3609 1.7116 6.4932 16.0636 65.3287 5.8830 6.0680 6.4806 24.0821 0.8683 3.3293 1.1894 8.9354 1.0951 5.2568 0.2879 0.0716 1.7033 34.7894 3.4105 7.6181 4.0737 2.8585 54.6089 15.0167 7.2052 7.0753 4.3107 10.1085 8.2213 2.2743 38.8182 13.5553 2.2264 1.3274 8.0697 1.2615 18.7149 15.2959 13.9303 15.7798 11.2364 1.0245 2.5307 0.8285 5.5278 4.7966 8.3846 9.4550 7.0099 15.7649 23.0799 7.3244 140.5170 308.9855 43.9419 25.2472 10.7872 33.4800 31.5674 30.0449 17.1919 8.0328 10.6722 6.8706 10.5512 10.7256 65.7318 45.4846 58.8524 69.0509 26.9541 55.4356 18.2180 30.2637
temp: 298.150 k
press: 1.00000 atm
elementType: 8 7 7 6 6 6 6 6 6 6 6 6 6 6 6 1 1 1 1 1 1 1 1 1 1 1 1 1 1 1 1 1 1 1 1
symmnumber: 1
zpe: 790085.4 jmol-1
zpe.correction: 0.300928 hartree
zpe.thermalcorrener: 0.317776 hartree
zpe.thermalcorrenthalpy: 0.318720 hartree
zpe.thermalcorrgfe: 0.255122 hartree
zpe.sumelectzpe: -652.845401 hartree
zpe.sumelectthermal: -652.828553 hartree
zpe.sumelectthermalent: -652.827609 hartree
zpe.sumelectthermalfe: -652.891207 hartree
dipole: -4.8119 -0.8540 0.3455
dipole: 4.8993
quadrupole: -81.7725 -100.5669 -92.9965
quadrupole: -3.6830 1.3398 -1.5645
quadrupole: 10.0061 -8.7883 -1.2179 -3.6830 1.3398 -1.5645
hfenergy: -653.1463288 hartree
pointgroup: C01 [X(C12H20N2O1)]
dipole: -1.8943255 0.3526048 -0.051365 debye
polarizability: 210.7111218|-8.5501122|130.176556|-5.903002|12.930149|116.8142839 unknown
InChI: InChI=1S/C12H20N2O/c1-8(2)5-10-7-13-11(6-9(3)4)12(15)14-10/h7-9,14H,5-6H2,1-4H3
charge 0 multiplicity 1
35 atoms
O  1.198655 -2.194587 -0.482356
N  -0.781345 -1.120523 0.155074
N  0.653022 0.946975 1.314012
C  -3.637277 0.571904 -0.541741
C  3.434632 0.30935 -0.689471
C  -3.001178 -0.115558 0.711658
C  2.829104 -0.049363 0.708368
C  -1.490067 -0.081545 0.747867
C  1.322517 -0.057174 0.729031
C  -3.240317 -0.129213 -1.861142
C  -5.174691 0.614387 -0.37893
C  3.102682 1.764074 -1.091917
C  4.962972 0.076549 -0.66667
C  0.637842 -1.204656 0.084296
C  -0.736246 0.937093 1.324033
H  -3.258564 1.613864 -0.575192
H  2.990431 -0.383364 -1.431392
H  -3.381823 0.392502 1.616834
H  -3.3599 -1.164845 0.759148
H  3.193587 -1.05758 0.985606
H  3.184504 0.680799 1.458121
H  -3.720732 0.368701 -2.722836
H  -3.573481 -1.186376 -1.862233
H  -2.149174 -0.107587 -2.031857
H  -5.470658 1.150622 0.541893
H  -5.646364 1.126935 -1.236869
H  -5.594459 -0.408838 -0.326453
H  3.499934 1.990999 -2.099022
H  3.554498 2.478974 -0.377443
H  2.013439 1.948865 -1.101582
H  5.204142 -0.977571 -0.435659
H  5.413676 0.323963 -1.645828
H  5.4468 0.714845 0.098184
H  -1.285845 -1.90134 -0.279696
H  -1.227217 1.778421 1.818961
