program: Gaussian 09
title: 000278153
version: EM64L-G09RevD.01
frameworkgroup: C1[X(C9H6N6O6)]
method: RPBEPBE
basis: SDD
operation: Freq
keyword: #pfreq=noraman
keyword: PBEPBE/SDD
title: #p freq=noraman PBEPBE/SDD
converged: YES YES NO NO
title: Mulliken charges:
elementType: O O O O O O N N N N N N C C C C C C C C C H H H H H H
charge: -0.161365 -0.167629 -0.185328 -0.182834 -0.192283 -0.163288 -0.244071 -0.052311 0.013659 0.027598 0.025129 0.066607 0.402539 0.288952 -0.309587 0.216156 -0.471594 0.441502 -0.365297 0.022678 -0.717324 0.301013 0.329197 0.303327 0.263647 0.257779 0.253127
chargesum: 0.00000
title: Mulliken charges with hydrogens summed into heavy atoms:
elementType: O O O O O O N N N N N N C C C C C C C C C
charge: -0.161365 -0.167629 -0.185328 -0.182834 -0.192283 -0.163288 -0.244071 -0.052311 0.013659 0.027598 0.025129 0.066607 0.402539 0.288952 -0.008575 0.216156 -0.142397 0.441502 -0.061970 0.022678 0.057231
polarizability: 3.05245805e+02 7.75500210e+00 1.83053129e+02 5.30620215e+00 -8.05371452e+00 8.05349894e+01
1716.lowfreq: -4.1534 -2.7027 -0.0007 -0.0006 0.0005 0.4529 26.4266 37.5250 47.7289
frequency: 26.4230 37.5192 47.7228 54.1471 57.0949 88.5786 124.8504 137.7394 139.2770 149.0106 172.5322 206.0173 235.4066 237.5974 275.2448 294.6997 324.8909 356.6287 374.6491 410.1576 456.6581 485.5260 502.6639 510.5206 564.1243 602.4816 620.1145 640.4957 644.1723 671.2686 683.6254 711.3131 714.1839 733.3100 737.1860 756.8264 774.2399 862.1248 869.1623 914.5884 944.1423 999.0720 1000.9197 1034.5143 1045.4002 1077.9398 1095.8072 1129.8483 1136.9334 1152.0511 1208.0251 1225.3864 1236.8542 1259.2810 1299.1264 1348.1450 1369.1806 1372.2088 1388.9029 1396.0534 1409.4162 1415.6148 1421.0219 1452.1265 1457.3269 1487.2914 1506.6295 1596.1343 1608.1948 3008.4179 3089.9508 3128.8063 3179.0196 3186.3876 3195.8326
redmass: 8.5951 10.9105 10.4345 11.5704 10.7999 7.8845 7.2114 1.3756 3.1223 7.8381 8.9249 6.2535 9.7335 6.2225 5.2673 6.6563 9.4255 7.6869 5.5258 6.8867 7.7232 5.9693 6.3332 6.4784 5.7982 6.2681 9.1660 7.8695 9.3380 6.8742 8.7824 7.2627 8.5399 8.3967 5.0526 12.2114 9.8708 2.2663 2.6308 11.4683 1.4684 1.3485 1.8776 4.0139 1.5052 2.8581 2.7745 8.4906 8.1537 1.4366 11.1805 12.1237 10.9803 1.3962 8.6753 4.4196 9.2386 7.7917 7.8336 6.1773 1.8749 2.8443 5.7958 1.0559 1.3695 3.1963 5.0098 9.3840 7.2291 1.0371 1.0967 1.1012 1.0901 1.0929 1.0972
irintensity: 3.0200 1.1179 0.2524 0.6880 0.7338 3.0713 3.2662 0.2162 2.2844 4.1883 0.2876 3.8670 1.2068 3.8249 0.3976 1.9237 0.9471 0.2992 0.7225 4.3594 2.3722 3.7994 7.1588 3.2493 4.2407 5.1418 5.1200 5.3101 1.0309 11.6046 28.8363 8.8452 16.3214 1.2794 4.8244 34.9973 34.7247 46.6542 40.7892 32.7435 26.1337 1.1228 0.3507 7.2105 4.4176 2.8050 52.9163 32.3206 41.0489 49.5617 386.5469 135.0778 162.1160 21.1356 76.4604 63.5396 92.4188 109.0719 33.7032 89.2294 15.7377 29.3892 76.6983 18.2207 24.5536 27.1380 112.5182 6.5165 92.3700 0.9445 3.5799 7.0056 1.1783 18.5341 5.5820
temp: 298.150 k
press: 1.00000 atm
elementType: 8 8 8 8 8 8 7 7 7 7 7 7 6 6 6 6 6 6 6 6 6 1 1 1 1 1 1
symmnumber: 1
zpe: 437036.1 jmol-1
zpe.correction: 0.166458 hartree
zpe.thermalcorrener: 0.184532 hartree
zpe.thermalcorrenthalpy: 0.185476 hartree
zpe.thermalcorrgfe: 0.117845 hartree
zpe.sumelectzpe: -1124.603846 hartree
zpe.sumelectthermal: -1124.585772 hartree
zpe.sumelectthermalent: -1124.584828 hartree
zpe.sumelectthermalfe: -1124.652459 hartree
dipole: 0.8120 -0.3287 -1.7488
dipole: 1.9560
quadrupole: -153.4108 -130.3190 -118.0038
quadrupole: 13.1053 -7.8757 1.2341
quadrupole: -19.4996 3.5922 15.9074 13.1053 -7.8757 1.2341
hfenergy: -1124.7703041 hartree
pointgroup: C01 [X(C9H6N6O6)]
dipole: 0.2731573 0.4422634 0.5674423 debye
polarizability: 305.5962896|3.5825974|156.4364748|6.458942|-45.2691608|106.8011583 unknown
InChI: InChI=1S/C9H6N6O6/c1-5-9(15(20)21)11-12(10-5)7-3-2-6(13(16)17)4-8(7)14(18)19/h2-4H,1H3
charge 0 multiplicity 1
27 atoms
O  -1.17818 -2.755663 1.677852
O  0.228387 -2.579792 -0.116723
O  -5.241138 1.669839 -0.624378
O  -5.398445 -0.465525 0.171636
O  5.316156 1.192084 -0.01703
O  4.056138 2.431709 -1.476002
N  0.964233 0.332854 0.179428
N  1.607994 -0.442285 1.143471
N  1.772301 1.160882 -0.55663
N  -0.674461 -2.125665 0.677309
N  -4.724787 0.567524 -0.201284
N  4.190781 1.548397 -0.552811
C  -0.446435 0.333913 0.014563
C  -1.248041 -0.786833 0.35834
C  -1.069841 1.517036 -0.449181
C  2.923264 -0.106798 1.004182
C  -2.650026 -0.709252 0.315802
C  -3.24002 0.483924 -0.139066
C  -2.468788 1.594418 -0.543835
C  3.002469 0.878877 -0.044079
C  3.98577 -0.724022 1.85393
H  -0.438758 2.367697 -0.718906
H  -3.270473 -1.560687 0.608008
H  -2.968435 2.498213 -0.900711
H  4.720407 -1.260163 1.228685
H  4.551402 0.047824 2.403151
H  3.531326 -1.428207 2.567477
