program: Gaussian 09
title: 000278134
version: EM64L-G09RevD.01
frameworkgroup: C1[X(C11H14Cl2O3)]
method: RPBEPBE
basis: SDD
operation: Freq
keyword: #p
keyword: freq=noraman
keyword: PBEPBE/SDD
title: #p freq=noraman PBEPBE/SDD
converged: YES YES NO NO
title: Mulliken charges:
elementType: Cl Cl O O O C C C C C C C C C C C H H H H H H H H H H H H H H
charge: -0.117979 -0.096775 -0.290825 -0.289272 -0.280723 0.301194 0.558971 0.117649 0.049475 0.278024 -0.593560 -0.802401 -0.828355 -0.493645 -0.521900 -0.533242 0.251697 0.290035 0.316511 0.299405 0.276120 0.254381 0.209256 0.232403 0.267533 0.207569 0.233232 0.234775 0.223599 0.246847
chargesum: 0.00000
title: Mulliken charges with hydrogens summed into heavy atoms:
elementType: Cl Cl O O O C C C C C C C C C C C
charge: -0.117979 -0.096775 -0.290825 -0.289272 -0.280723 0.301194 0.558971 0.117649 0.049475 0.278024 -0.341863 -0.195855 -0.252830 0.202395 0.186434 0.171979
polarizability: 2.04690329e+02 -1.24862243e+00 1.78507514e+02 -7.11733450e-01 3.57871400e+00 1.04195736e+02
1716.lowfreq: -5.0974 -0.0020 -0.0016 0.0015 5.5379 8.3015 40.7805 48.6876 52.1669
frequency: 40.7435 48.6832 52.1489 53.6874 82.3166 90.4516 103.2000 116.6922 150.6530 162.0187 188.4265 193.1529 211.0667 233.1896 250.2248 272.2310 309.5938 322.5358 334.1386 347.6186 392.5670 409.8092 477.6888 487.1173 526.9485 557.1083 578.1083 617.9487 663.9820 688.4159 708.7881 787.3737 827.3449 844.1664 864.9011 914.7979 932.1158 944.4776 1010.3046 1064.9484 1103.8558 1106.6848 1109.7688 1113.2784 1120.8745 1150.3134 1152.5549 1155.6641 1163.0777 1220.2638 1241.9454 1244.6724 1256.5863 1322.3795 1379.7232 1395.9912 1424.9191 1439.8333 1445.1665 1453.1190 1457.1190 1457.4262 1467.1928 1470.0493 1471.9111 1477.1452 1482.7736 1484.7972 1577.1398 1592.2799 2968.5080 2973.4774 2983.6858 3061.3150 3069.8698 3086.4978 3088.2947 3095.5058 3129.4912 3129.5657 3130.7815 3150.9025 3159.9492 3181.6866
redmass: 6.9799 7.6660 7.6587 3.2723 5.6197 3.7174 1.6844 5.1388 1.5752 3.9188 1.7489 2.1838 2.1933 2.3828 2.5599 2.5717 4.2805 3.4912 3.0900 4.0936 5.7577 4.9834 6.8229 6.1603 5.2729 7.4627 6.1078 4.4848 3.8507 6.1133 6.9648 4.1556 3.4265 1.8292 4.9504 2.3883 1.7943 4.6098 4.7388 2.8797 4.0186 1.2691 1.2791 1.2607 1.1124 1.3748 1.3158 1.5234 1.5280 2.9977 1.5640 1.3348 1.2049 5.2784 5.9017 2.6295 1.2308 1.2502 1.3686 1.0858 1.1569 1.1628 1.0520 1.3843 1.0567 1.1239 1.5556 1.2030 8.1643 7.1001 1.0325 1.0357 1.0336 1.1044 1.0580 1.0956 1.0595 1.0981 1.1041 1.1020 1.1049 1.1111 1.0910 1.1093
irintensity: 0.9874 1.5788 1.6427 3.2364 5.8815 2.9241 2.1879 9.9347 2.4105 3.0399 4.3707 0.2700 4.3958 5.3938 3.1093 3.9995 1.5582 5.7160 1.4818 2.7544 2.4325 6.1668 19.6596 32.0277 1.1108 104.9403 23.9579 65.4890 14.1363 7.5735 16.3820 2.0124 13.9187 22.4431 18.3412 23.0932 4.4488 0.9682 41.6224 91.6707 162.2152 0.6853 23.9687 1.0643 5.7907 0.9365 3.3511 15.9132 80.6839 80.5002 3.0068 25.6049 61.2543 274.8677 39.0233 59.7895 1.1500 21.2385 37.7623 17.1376 11.1585 15.6592 15.9723 87.4390 23.7517 7.6321 36.4250 7.3283 29.0483 123.5713 63.3754 73.4391 74.4552 37.5053 16.4152 35.1772 7.9698 40.4983 28.6957 4.1291 15.9728 1.3484 6.2429 0.2953
temp: 298.150 k
press: 1.00000 atm
elementType: 17 17 8 8 8 6 6 6 6 6 6 6 6 6 6 6 1 1 1 1 1 1 1 1 1 1 1 1 1 1
symmnumber: 1
zpe: 604172.3 jmol-1
zpe.correction: 0.230117 hartree
zpe.thermalcorrener: 0.248216 hartree
zpe.thermalcorrenthalpy: 0.249161 hartree
zpe.thermalcorrgfe: 0.182570 hartree
zpe.sumelectzpe: -1572.088055 hartree
zpe.sumelectthermal: -1572.069955 hartree
zpe.sumelectthermalent: -1572.069011 hartree
zpe.sumelectthermalfe: -1572.135602 hartree
dipole: -5.2245 1.6963 2.2617
dipole: 5.9404
quadrupole: -107.5652 -95.3399 -112.5372
quadrupole: 0.3985 -4.9024 8.3748
quadrupole: -2.4177 9.8075 -7.3898 0.3985 -4.9024 8.3748
hfenergy: -1572.3181718 hartree
pointgroup: C01 [X(C11H14Cl2O3)]
dipole: 1.9470048 0.4847414 -1.1984581 debye
polarizability: 200.3846341|-0.7958663|177.646979|-19.6737607|10.0421518|109.361966 unknown
InChI: InChI=1S/C11H14Cl2O3/c1-14-9-4-7(5-12)8(6-13)10(15-2)11(9)16-3/h4H,5-6H2,1-3H3
charge 0 multiplicity 1
30 atoms
Cl -3.621214 -1.301537 -0.793989
Cl -2.938904 2.411325 2.128229
O  -0.207761 -2.404797 0.580101
O  2.342185 -1.176369 0.081922
O  2.456838 1.571232 -0.381655
C  -1.274597 -0.276489 0.452456
C  -1.224322 1.129693 0.248139
C  -0.071946 -1.039234 0.327471
C  1.169882 -0.404767 0.037276
C  1.193247 1.011543 -0.145855
C  0.003034 1.763356 -0.054361
C  -2.548764 -0.975362 0.793699
C  -2.469042 1.960987 0.307927
C  0.618924 -3.397003 -0.13295
C  3.22369 -1.154989 -1.107367
C  2.551739 3.034165 -0.444786
H  0.01911 2.848048 -0.192403
H  -3.218911 -0.384378 1.431832
H  -2.379981 -1.980579 1.193922
H  -3.363346 1.446892 -0.069531
H  -2.349457 2.94038 -0.174709
H  1.629411 -3.447486 0.29935
H  0.680063 -3.155812 -1.210992
H  0.082202 -4.34868 0.00425
H  3.611447 -0.139796 -1.285412
H  2.675602 -1.517163 -1.99939
H  4.044769 -1.846063 -0.863505
H  2.191034 3.495277 0.493831
H  1.983463 3.437312 -1.304798
H  3.623004 3.244597 -0.576302
