program: Gaussian 09
title: 000278146
version: EM64L-G09RevD.01
frameworkgroup: C1[X(C17H13Cl)]
method: RPBEPBE
basis: SDD
operation: Freq
keyword: #p
keyword: freq=noraman
keyword: PBEPBE/SDD
title: #p freq=noraman PBEPBE/SDD
converged: YES YES NO NO
title: Mulliken charges:
elementType: Cl C C C C C C C C C C C C C C C C C H H H H H H H H H H H H H
charge: -0.071670 0.422551 -0.709836 0.180957 0.385703 0.568288 -0.460428 -0.376265 -0.462296 -0.245840 -0.436491 -0.345259 -0.362580 -0.264119 -0.243300 -0.236622 -0.240210 -0.234471 0.249546 0.252928 0.239438 0.252012 0.239240 0.227542 0.237612 0.255506 0.228458 0.228621 0.255701 0.231189 0.234093
chargesum: 0.00000
title: Mulliken charges with hydrogens summed into heavy atoms:
elementType: Cl C C C C C C C C C C C C C C C C C
charge: -0.071670 0.422551 -0.207361 0.180957 0.385703 0.568288 -0.220990 -0.124253 -0.223056 -0.018298 -0.198878 -0.345259 -0.107074 -0.035661 -0.014679 0.019079 -0.009021 -0.000378
polarizability: 2.21545287e+02 -1.39521944e+01 1.92401347e+02 1.10341835e+01 4.66515527e+00 1.47313657e+02
1716.lowfreq: -6.7325 0.0025 0.0025 0.0026 5.6313 6.2751 11.6510 34.0454 55.8993
frequency: 6.6983 34.0088 55.8854 125.3612 138.3853 166.5863 178.7425 216.8944 253.8223 286.8283 355.9019 386.9790 418.3433 423.5748 437.1888 473.1779 492.1667 509.2930 511.5258 527.2836 576.4794 611.6733 646.4859 678.4000 694.4914 723.1960 745.5508 758.1501 781.2592 790.0296 800.5174 818.8510 862.0591 867.2042 884.2016 916.2339 929.3445 957.3433 962.9566 985.1568 989.4031 994.5168 1011.5383 1023.1301 1038.7459 1048.5727 1078.2987 1121.3369 1150.4266 1169.4005 1173.3683 1181.2654 1190.2603 1201.8071 1237.8898 1249.1576 1265.7726 1277.3195 1313.2259 1374.5166 1379.7935 1407.2928 1419.7341 1423.9333 1440.9655 1455.6923 1458.3761 1470.3006 1518.0780 1573.7781 1590.7548 1599.7474 1605.3752 1633.6579 2984.1089 3034.2259 3119.0440 3120.4417 3127.8667 3132.8092 3133.1325 3145.2131 3149.9041 3155.4688 3159.4797 3164.6791 3174.5188
redmass: 6.7128 5.0490 4.8067 4.5067 4.4068 8.6726 4.0756 5.4268 4.0089 2.4868 5.9873 7.8316 3.2947 3.0898 3.1788 3.2605 4.6992 4.7944 5.8285 3.7661 5.3956 4.0086 4.6965 4.6581 4.0830 3.4370 1.4013 1.2343 3.6052 4.1437 1.9102 1.7880 1.3866 2.8398 2.0704 1.6310 1.6335 1.4852 1.3866 1.3640 1.3458 1.3500 6.9144 3.0716 2.2260 2.6134 2.2180 1.7101 1.4206 1.1218 1.1358 1.2030 1.2302 1.7655 1.8272 1.6346 1.6026 1.7199 1.6479 4.9027 2.2924 2.9744 5.2039 2.1963 2.2797 2.2238 2.2253 1.3057 3.8446 6.0580 7.5177 5.3563 6.9281 6.5687 1.0618 1.0972 1.0863 1.0865 1.0913 1.0857 1.0884 1.0903 1.0944 1.0991 1.0952 1.1001 1.0996
irintensity: 0.2941 0.1103 0.2392 0.4806 0.1158 1.1982 2.2171 1.7041 2.5741 1.8534 2.1523 2.2577 11.6773 4.3732 5.1084 0.0350 1.3534 0.7894 1.2843 4.8056 4.4935 4.6216 6.4037 18.5230 3.2537 2.7972 1.5032 77.6040 10.0277 9.0294 88.1896 30.8729 0.3447 0.2331 6.1656 1.9563 0.6930 1.8761 1.1066 2.3647 0.2802 1.0511 58.1421 8.9863 8.9020 0.1262 8.9684 4.7899 1.7334 0.3900 4.1162 0.4219 0.5447 1.9843 2.9261 3.6827 2.2062 0.5687 3.7171 8.0829 7.2053 4.6927 1.4870 15.6961 6.5466 22.0698 31.3766 5.0871 9.7355 13.1986 1.9520 10.2336 1.4905 0.3197 12.1899 6.7029 3.8475 1.0593 19.6814 1.2885 6.7276 6.9661 32.6317 38.6286 14.9851 21.5217 14.9830
temp: 298.150 k
press: 1.00000 atm
elementType: 17 6 6 6 6 6 6 6 6 6 6 6 6 6 6 6 6 6 1 1 1 1 1 1 1 1 1 1 1 1 1
symmnumber: 1
zpe: 637947.9 jmol-1
zpe.correction: 0.242982 hartree
zpe.thermalcorrener: 0.257316 hartree
zpe.thermalcorrenthalpy: 0.258260 hartree
zpe.thermalcorrgfe: 0.198983 hartree
zpe.sumelectzpe: -1114.456688 hartree
zpe.sumelectthermal: -1114.442354 hartree
zpe.sumelectthermalent: -1114.441410 hartree
zpe.sumelectthermalfe: -1114.500687 hartree
dipole: 0.7284 -0.4987 1.7225
dipole: 1.9355
quadrupole: -103.1445 -104.0122 -111.8334
quadrupole: -1.7178 -2.8893 1.5157
quadrupole: 3.1856 2.3178 -5.5034 -1.7178 -2.8893 1.5157
hfenergy: -1114.6996699 hartree
pointgroup: C01 [X(C17H13Cl1)]
dipole: -0.1694305 -0.014458 0.7422475 debye
polarizability: 210.3484376|-11.6088974|194.0916027|-23.1607391|17.6817448|156.8202513 unknown
InChI: InChI=1S/C17H13Cl/c18-17-11-4-2-7-15(17)12-14-9-5-8-13-6-1-3-10-16(13)14/h1-11H,12H2
charge 0 multiplicity 1
31 atoms
Cl 3.034103 -0.666904 -2.762185
C  -0.441011 1.166588 -0.365335
C  0.888118 0.89175 -1.054794
C  -1.458097 0.141555 -0.269058
C  -2.71883 0.453007 0.378629
C  1.852341 -0.014467 -0.284844
C  -0.699876 2.434009 0.17222
C  -1.273871 -1.180583 -0.797918
C  -2.933511 1.765983 0.915032
C  -1.940922 2.739908 0.813447
C  -3.7327 -0.558077 0.466482
C  2.873612 -0.750856 -0.932179
C  1.798783 -0.122505 1.130172
C  -2.280215 -2.144639 -0.698715
C  -3.522079 -1.833195 -0.061045
C  3.798538 -1.559317 -0.243999
C  2.71196 -0.922785 1.849309
C  3.714946 -1.644917 1.163763
H  0.718534 0.456567 -2.057422
H  1.400291 1.85684 -1.237733
H  0.067783 3.213715 0.096958
H  -0.327031 -1.440091 -1.281604
H  -3.889803 1.991034 1.402237
H  -2.105105 3.743813 1.219788
H  -4.682097 -0.309941 0.956387
H  1.017435 0.430332 1.662783
H  -2.119734 -3.147503 -1.109598
H  -4.303217 -2.598057 0.010383
H  4.565969 -2.107979 -0.797587
H  2.639219 -0.984252 2.940389
H  4.427171 -2.270835 1.711636
