program: Gaussian 09
title: 000278202
version: EM64L-G09RevD.01
frameworkgroup: C1[X(C18H22N2O3S)]
method: RPBEPBE
basis: SDD
operation: Freq
keyword: #p
keyword: freq=noraman
keyword: PBEPBE/SDD
title: #p freq=noraman PBEPBE/SDD
converged: YES YES NO NO
title: Mulliken charges:
elementType: S O O O N N C C C C C C C C C C C C C C C C C C H H H H H H H H H H H H H H H H H H H H H H
charge: 0.963317 -0.294658 -0.548331 -0.511414 -0.515357 -0.000312 -0.536866 -0.504940 0.385401 0.236314 0.208471 -0.398314 -0.045617 -0.798643 -0.345324 -0.261641 -0.263364 -0.214348 0.448143 -0.238011 -0.383178 -0.334914 -0.801330 -0.540635 0.210864 0.235605 0.210761 0.246954 0.231478 0.263033 0.224313 0.241964 0.303125 0.236283 0.225213 0.286722 0.286043 0.217911 0.243572 0.237815 0.227381 0.226051 0.246163 0.216503 0.246630 0.231169
chargesum: 0.00000
title: Mulliken charges with hydrogens summed into heavy atoms:
elementType: S O O O N N C C C C C C C C C C C C C C C C C C
charge: 0.963317 -0.294658 -0.548331 -0.511414 -0.212233 -0.000312 -0.090396 -0.047225 0.385401 0.236314 0.208471 -0.166836 -0.045617 -0.069334 -0.109041 -0.036429 0.023359 0.071695 0.448143 -0.020100 -0.139606 -0.097099 -0.101735 0.153666
polarizability: 2.47852607e+02 2.24642714e+01 2.73528304e+02 3.32294621e+01 -1.61922452e+01 2.07016276e+02
1716.lowfreq: -9.5672 -3.9992 -0.0013 0.0003 0.0012 1.7463 9.8566 16.1390 23.3215
frequency: 4.3970 15.3009 23.1428 34.3591 40.8703 47.5539 71.1950 81.3438 89.6579 101.9293 105.1344 125.1102 130.7321 141.0209 161.7692 187.5357 208.4931 214.2131 224.4590 231.4883 259.8928 278.5628 299.8372 315.8671 322.9779 362.5434 380.2136 391.3688 394.0245 405.6886 426.5843 449.8134 468.5426 476.3881 499.6022 509.0405 536.9150 565.2014 577.3502 585.1661 588.2289 621.9557 704.3821 708.5776 722.0258 740.5674 753.9413 777.1585 791.2386 807.6104 823.2268 830.2766 847.1344 849.2447 910.2080 913.7490 931.0121 948.1656 954.6340 962.3767 969.6700 980.9619 986.5243 989.4997 992.1853 996.6699 1021.2819 1042.9176 1047.8492 1055.8006 1063.7343 1105.4898 1115.0677 1118.4456 1150.3190 1162.7387 1173.1361 1184.1246 1187.3725 1213.7859 1217.7970 1234.6128 1269.2894 1287.2193 1291.2970 1297.0024 1314.8693 1339.7308 1382.1144 1383.5159 1391.3407 1392.4612 1397.4780 1430.0806 1444.4163 1453.6261 1458.6716 1465.5426 1466.3321 1470.0019 1470.9250 1473.0856 1473.4287 1474.0717 1490.1442 1593.4092 1594.9878 1596.5719 1596.7367 1607.0764 2959.9073 2962.3222 2979.3669 2979.8007 3001.4865 3043.0393 3055.1736 3058.2430 3060.9081 3076.2998 3088.3422 3105.1544 3115.3550 3120.2499 3125.5831 3133.6357 3140.4290 3153.5132 3160.7714 3166.3322 3174.5004 3223.3090
redmass: 4.4639 4.6360 5.2021 3.9313 3.7470 1.1295 4.5593 5.2113 2.9373 3.3668 3.6726 1.5418 6.5747 5.2763 2.8193 3.4619 2.9137 4.0374 7.5137 2.4069 2.0311 3.7416 3.9798 3.7360 2.6209 3.3716 2.5859 3.3165 7.8582 2.8501 4.5159 4.4738 4.1842 3.3492 3.9762 3.0674 3.5545 3.0717 3.9624 4.6117 3.6125 6.9532 3.5463 3.2631 3.8089 2.5701 1.4652 4.9398 4.1195 5.8620 1.6984 1.9659 1.4122 1.2638 2.1409 2.0074 1.4920 8.6576 2.0093 1.5159 1.3290 1.3961 8.4374 1.4399 2.2063 4.9379 1.6109 2.2187 1.5911 2.4764 2.1937 2.0866 1.2659 1.2876 1.3928 1.3911 1.0826 1.1479 1.4382 1.6207 2.9599 2.2894 1.7354 1.3753 1.5289 1.2617 1.3392 1.6839 6.0568 1.2289 6.5770 2.8344 1.2393 1.4913 1.5678 1.1302 1.0754 1.1184 1.0731 1.1166 1.0843 1.3487 1.4723 1.1489 2.1196 8.1758 6.7325 7.0209 6.2936 6.4716 1.0429 1.0328 1.0382 1.0637 1.0606 1.0910 1.1039 1.1017 1.0956 1.0978 1.1000 1.0979 1.0872 1.0997 1.0892 1.0891 1.0901 1.0942 1.0958 1.0979 1.0960 1.0738
irintensity: 1.2336 0.4694 0.8329 1.7042 0.3203 0.2827 0.2332 0.4254 1.0441 4.7928 7.2698 0.4547 1.6853 0.7157 0.6388 5.2779 1.4595 1.2788 12.7942 2.0319 5.0291 13.4829 1.1048 4.2002 0.8245 12.4595 1.8937 9.9814 26.7371 0.0706 61.0699 5.2365 13.5704 3.9276 5.1909 70.2864 2.3352 15.4161 1.2829 10.3072 13.7167 0.1692 35.8425 1.2772 26.1056 9.2301 100.3505 6.1429 2.2965 119.4449 44.0534 35.4709 3.0357 2.8043 2.8695 13.7466 3.0297 66.9699 4.0530 3.2283 0.2442 0.9134 31.6846 2.5721 0.6071 0.6616 5.3546 17.6571 24.3670 19.1816 1.0788 39.2916 1.0393 6.8426 0.2593 4.7438 1.5091 8.0577 1.4620 35.8722 6.4596 64.0036 4.7407 2.2038 12.3778 2.6237 3.2505 4.0213 3.1417 38.8645 5.3157 10.3977 18.4992 15.1538 5.1674 24.6241 14.2546 3.0502 23.5831 45.1428 19.1052 3.1125 33.4172 11.7186 34.9344 36.1056 2.1356 9.5856 8.8211 17.4600 18.6288 50.8709 28.3226 25.0169 62.3954 19.4493 39.9442 10.6213 18.5322 18.6520 16.1241 17.6561 6.6300 22.5627 14.0240 12.8895 7.5819 28.7795 5.7298 13.1120 3.1624 11.8850
temp: 298.150 k
press: 1.00000 atm
elementType: 16 8 8 8 7 7 6 6 6 6 6 6 6 6 6 6 6 6 6 6 6 6 6 6 1 1 1 1 1 1 1 1 1 1 1 1 1 1 1 1 1 1 1 1 1 1
symmnumber: 1
zpe: 951809.6 jmol-1
zpe.correction: 0.362525 hartree
zpe.thermalcorrener: 0.388145 hartree
zpe.thermalcorrenthalpy: 0.389089 hartree
zpe.thermalcorrgfe: 0.302497 hartree
zpe.sumelectzpe: -1430.355140 hartree
zpe.sumelectthermal: -1430.329520 hartree
zpe.sumelectthermalent: -1430.328576 hartree
zpe.sumelectthermalfe: -1430.415168 hartree
dipole: -3.1234 4.3802 2.9725
dipole: 6.1463
quadrupole: -154.9379 -142.2542 -145.8923
quadrupole: 28.6857 10.0989 -7.8342
quadrupole: -7.2431 5.4406 1.8025 28.6857 10.0989 -7.8342
hfenergy: -1430.7176651 hartree
pointgroup: C01 [X(C18H22N2O3S1)]
dipole: 0.7191576 1.9525626 -1.2319697 debye
polarizability: 259.0891749|-25.8461393|260.2339607|32.3139593|20.7502014|209.0740508 unknown
InChI: InChI=1S/C18H22N2O3S/c1-14-8-12-17(13-9-14)24(21,22)20-19-15(2)10-11-16-6-4-5-7-18(16)23-3/h4-9,12-13,20H,10-11H2,1-3H3
charge 0 multiplicity 1
46 atoms
S  -1.464273 -2.815968 0.591968
O  1.99843 0.492648 -1.568079
O  -2.090498 -3.928801 -0.420866
O  -1.423803 -3.042708 2.201365
N  0.304215 -2.5279 -0.159659
N  1.082757 -1.778861 0.716558
C  3.698522 0.477651 0.695431
C  3.188655 -0.817443 1.424277
C  2.610033 1.521223 0.508652
C  2.38719 -1.736387 0.53039
C  1.738044 1.498416 -0.619395
C  2.411102 2.533735 1.47507
C  -2.231264 -1.144301 0.23219
C  3.093236 -2.51543 -0.562635
C  0.698126 2.44926 -0.756262
C  1.381781 3.496202 1.349578
C  -2.955374 -0.999723 -0.961317
C  -2.055136 -0.111813 1.166581
C  -3.388727 1.341764 -0.316021
C  0.524377 3.445857 0.230534
C  -3.538067 0.259873 -1.224445
C  -2.640691 1.138648 0.874058
C  -4.040393 2.683818 -0.59594
C  1.04435 0.337228 -2.669622
H  4.509467 0.909215 1.311751
H  4.136191 0.198127 -0.279929
H  4.074207 -1.369607 1.798532
H  2.573132 -0.529262 2.293717
H  3.080664 2.56608 2.3439
H  2.703429 -2.218539 -1.554387
H  2.933198 -3.608834 -0.455271
H  4.179253 -2.333209 -0.546699
H  0.634727 -3.487931 -0.413434
H  0.021873 2.421448 -1.615657
H  1.256028 4.271959 2.112235
H  -3.069579 -1.848468 -1.643634
H  -1.480954 -0.280104 2.082001
H  -0.278407 4.183496 0.114877
H  -4.117994 0.401738 -2.143758
H  -2.506292 1.968679 1.576776
H  -3.422114 3.519403 -0.222857
H  -4.212884 2.836811 -1.675339
H  -5.023581 2.755342 -0.092017
H  1.021977 1.238204 -3.313518
H  0.030398 0.116783 -2.286035
H  1.412469 -0.52062 -3.251965
