program: Gaussian 09
title: 000278123
version: EM64L-G09RevD.01
frameworkgroup: C1[X(C14H18)]
method: RPBEPBE
basis: SDD
operation: Freq
keyword: #p
keyword: freq=noraman
keyword: PBEPBE/SDD
title: #p freq=noraman PBEPBE/SDD
converged: YES YES NO NO
title: Mulliken charges:
elementType: C C C C C C C C C C C C C C H H H H H H H H H H H H H H H H H H
charge: -0.388683 -0.382493 -0.573490 -0.380062 -0.459527 0.366778 -0.366095 0.313242 -0.397088 -0.408947 0.440358 -0.396122 -0.402006 -0.810565 0.206732 0.197358 0.183570 0.201123 0.222084 0.204660 0.197251 0.207254 0.199056 0.198578 0.227325 0.236834 0.230245 0.225617 0.225394 0.234328 0.223546 0.223744
chargesum: 0.00000
title: Mulliken charges with hydrogens summed into heavy atoms:
elementType: C C C C C C C C C C C C C C
charge: 0.015407 0.002200 -0.146746 0.024443 -0.061894 0.366778 -0.138771 0.313242 -0.160254 -0.178702 0.440358 -0.170504 -0.176611 -0.128947
polarizability: 2.23483148e+02 -9.86878664e+00 1.45022467e+02 -3.49590940e+00 1.99180625e+00 9.25043021e+01
1716.lowfreq: -27.6355 -16.1151 -0.0004 0.0003 0.0006 8.1025 11.8627 47.6109 63.5463
frequency: -27.2329 47.5575 63.4778 85.6915 151.7459 205.5384 216.4998 243.3668 293.6689 323.6355 327.4341 353.9124 401.0334 409.4077 439.0924 479.6806 512.5637 563.2876 608.2945 641.0189 688.7068 725.4286 757.1734 795.2603 806.9260 829.9660 845.5774 851.2187 855.0296 888.4914 920.1492 952.1808 962.1607 971.3471 974.3324 986.5064 1011.5172 1046.6255 1046.7368 1067.5072 1079.4449 1125.1649 1129.7776 1142.2502 1191.8154 1198.2308 1213.1445 1227.4096 1256.4684 1257.4416 1286.1994 1305.6024 1310.0633 1319.7967 1330.8898 1347.3755 1353.0267 1355.9783 1370.4500 1396.6238 1409.0129 1460.3667 1461.9171 1465.3845 1466.6655 1470.9057 1472.7964 1482.8780 1507.9258 1569.2567 1621.2254 1647.3450 2943.1131 2952.8169 2960.2900 2968.6569 2970.4541 2971.7490 3011.7597 3026.0305 3031.4630 3035.8501 3044.0809 3052.4214 3082.0511 3105.7305 3113.1975 3114.7146 3138.7505 3145.2113
redmass: 1.0226 3.4196 3.4761 3.6001 3.0421 2.3193 2.5797 4.1681 2.8814 2.4846 2.4902 2.4757 3.4437 2.8745 2.7938 1.6316 2.7489 2.9238 3.3978 6.2510 2.3663 2.9651 2.9519 2.9176 1.6175 1.5395 1.3201 1.5397 1.6938 2.4047 2.6221 1.3419 2.2820 1.3782 1.8706 1.4067 2.8107 1.5740 1.9949 2.0428 1.9382 1.8888 1.4101 1.4945 1.1607 1.1123 1.2960 2.8942 1.2622 1.4979 1.6684 1.2768 1.2883 1.3438 1.4973 1.9492 1.4622 1.4842 2.7269 1.2255 3.2500 1.0863 1.0875 1.0969 1.0932 1.0935 1.0566 1.1008 2.5959 5.6491 6.3172 7.1546 1.0665 1.0611 1.0672 1.0608 1.0630 1.0391 1.0969 1.1021 1.0931 1.1019 1.0930 1.0946 1.0997 1.0905 1.0875 1.0874 1.0949 1.0961
irintensity: 0.5382 0.5941 0.2309 0.3676 0.3419 0.1713 0.0850 0.2283 0.6565 0.8315 0.7606 0.9278 2.9263 0.1169 0.7961 0.3109 14.1960 7.9093 1.2287 0.5371 0.2086 1.2323 0.5729 7.0747 26.2030 45.0018 1.3351 0.0688 15.4366 2.8112 0.7606 0.2708 16.1695 0.1321 3.2252 0.5940 1.6376 16.8259 2.9695 0.5237 0.5181 5.0644 5.7440 0.3931 0.8175 1.5565 3.2933 0.4369 0.3064 1.4542 4.3898 4.8590 0.0367 0.5561 0.8975 3.9167 0.7032 0.7236 5.2189 7.3441 0.7585 7.0418 6.2195 9.4115 3.5418 14.5858 12.9222 24.8354 36.6286 0.7629 0.5325 2.5735 47.0251 28.6015 18.5661 42.0946 56.6547 39.0058 82.7835 23.3648 63.5155 101.3813 24.9040 25.5038 18.7822 32.6324 5.6486 28.5198 42.2407 0.7413
temp: 298.150 k
press: 1.00000 atm
elementType: 6 6 6 6 6 6 6 6 6 6 6 6 6 6 1 1 1 1 1 1 1 1 1 1 1 1 1 1 1 1 1 1
symmnumber: 1
zpe: 731222.9 jmol-1
zpe.correction: 0.278508 hartree
zpe.thermalcorrener: 0.290863 hartree
zpe.thermalcorrenthalpy: 0.291807 hartree
zpe.thermalcorrgfe: 0.239804 hartree
zpe.sumelectzpe: -543.237604 hartree
zpe.sumelectthermal: -543.225249 hartree
zpe.sumelectthermalent: -543.224305 hartree
zpe.sumelectthermalfe: -543.276308 hartree
dipole: -0.2044 -0.2054 -0.1234
dipole: 0.3150
quadrupole: -75.7477 -79.8749 -88.5117
quadrupole: 0.0260 -1.5789 0.3574
quadrupole: 5.6304 1.5032 -7.1336 0.0260 -1.5789 0.3574
hfenergy: -543.516112 hartree
pointgroup: C01 [X(C14H18)]
dipole: 0.0811793 -0.0741664 0.0571346 debye
polarizability: 223.2997741|10.0356374|144.0664752|-4.8708958|-7.8894973|93.6436676 unknown
InChI: InChI=1S/C14H18/c1-12-8-10-14(11-9-12)13-6-4-2-3-5-7-13/h6,8-11H,2-5,7H2,1H3
charge 0 multiplicity 1
32 atoms
C  2.622073 -1.612959 0.188591
C  3.955539 -0.827558 0.262978
C  1.61037 -1.060858 -0.855772
C  3.841618 0.651272 0.705023
C  3.000198 1.542821 -0.255857
C  0.837591 0.180125 -0.40272
C  1.499668 1.347291 -0.131175
C  -0.64358 0.081346 -0.237073
C  -1.496652 1.19432 -0.48877
C  -1.263955 -1.129251 0.181193
C  -3.503775 -0.099305 0.126996
C  -2.891592 1.105052 -0.308834
C  -2.660687 -1.214943 0.361921
C  -5.004044 -0.185127 0.347454
H  2.143733 -1.633828 1.18811
H  2.860299 -2.663957 -0.073152
H  4.438495 -0.861284 -0.73703
H  4.641127 -1.355044 0.956902
H  0.900772 -1.858981 -1.138331
H  2.173429 -0.814706 -1.781543
H  4.864918 1.073203 0.771868
H  3.405434 0.7069 1.721873
H  3.330066 1.332708 -1.297349
H  3.241092 2.604538 -0.06116
H  0.924442 2.202077 0.250149
H  -1.060772 2.127693 -0.862941
H  -0.647021 -2.010696 0.390872
H  -3.51971 1.978631 -0.524628
H  -3.103481 -2.162809 0.692937
H  -5.270424 0.090799 1.386804
H  -5.552572 0.500069 -0.323026
H  -5.381999 -1.208239 0.173589
