program: Gaussian 09
title: 000278122
version: EM64L-G09RevD.01
frameworkgroup: C1[X(C14H18O)]
method: RPBEPBE
basis: SDD
operation: Freq
keyword: #pfreq=noraman
keyword: PBEPBE/SDD
title: #p freq=noraman PBEPBE/SDD
converged: YES YES NO NO
title: Mulliken charges:
elementType: O C C C C C C C C C C C C C C H H H H H H H H H H H H H H H H H H
charge: -0.265169 -0.382340 -0.387880 -0.379707 -0.572745 -0.459452 0.367342 -0.367949 0.323311 -0.376537 -0.416514 -0.365149 -0.370415 0.317091 -0.537673 0.206418 0.196409 0.183442 0.200785 0.196928 0.206908 0.220654 0.205391 0.198588 0.198194 0.224930 0.239264 0.229156 0.246808 0.235969 0.243991 0.219886 0.220067
chargesum: 0.00000
title: Mulliken charges with hydrogens summed into heavy atoms:
elementType: O C C C C C C C C C C C C C C
charge: -0.265169 0.001886 0.014946 0.024129 -0.146701 -0.062670 0.367342 -0.143019 0.323311 -0.137273 -0.187358 -0.118341 -0.134446 0.317091 0.146271
polarizability: 2.42657521e+02 -1.30402161e+01 1.47148389e+02 -1.95496635e+00 -3.36197103e-02 9.38454047e+01
1716.lowfreq: -15.1193 -6.8691 -3.9017 -0.0005 -0.0003 0.0002 44.0439 49.6230 72.0708
frequency: 44.0410 49.3666 72.0506 104.8085 151.3972 194.3380 211.0143 225.0141 231.7992 264.5931 325.4883 330.2080 340.2884 407.2144 415.9900 419.6753 474.8198 493.7358 517.4756 563.3648 603.1261 637.3254 682.8430 730.3639 751.7211 783.9701 802.7942 816.9875 833.2104 848.8178 852.3366 887.4200 918.1562 934.1871 961.5032 963.3493 972.5102 988.2533 1002.2653 1046.6988 1067.2093 1078.8066 1110.2897 1116.2552 1126.6135 1141.8052 1156.6904 1182.0777 1192.0398 1213.0465 1231.3316 1257.3282 1258.3141 1285.6359 1302.3719 1308.6288 1320.0207 1330.5354 1346.6692 1353.4085 1355.7468 1373.8905 1420.5362 1434.3024 1459.5657 1461.6986 1465.1285 1465.1747 1467.4451 1473.6592 1482.9348 1501.1905 1570.5846 1618.5451 1645.3891 2942.5039 2952.9438 2956.4947 2960.1117 2968.0206 2969.4904 3011.7185 3025.0437 3031.0500 3034.9909 3043.3383 3044.0426 3104.5565 3123.0509 3131.2338 3136.8959 3160.2760 3165.9709
redmass: 3.7514 3.1692 3.7616 3.5824 3.2908 2.5296 2.0576 1.8474 2.6225 2.3913 2.0250 2.7833 3.5296 3.3624 3.1928 3.5111 1.8925 2.4857 2.7400 2.9053 3.6489 5.8295 2.3914 3.5049 3.2465 3.7323 1.4376 1.3448 1.5651 1.5058 1.9161 2.3876 2.6056 1.4211 2.2215 1.4063 1.8942 7.9174 2.5013 2.0179 2.0397 1.9619 1.2611 1.3916 2.0248 1.4569 1.3301 1.2946 1.1515 1.2904 2.6881 1.4500 1.3288 1.6483 1.2857 1.2601 1.3472 1.5322 1.8826 1.4666 1.4663 2.9826 3.7697 1.1660 1.0873 1.0918 1.0572 1.0883 1.0954 1.0763 1.1151 2.3255 6.9339 6.3143 7.1609 1.0666 1.0609 1.0330 1.0678 1.0603 1.0636 1.0970 1.1021 1.0934 1.1018 1.1038 1.0927 1.0908 1.0990 1.0878 1.0879 1.0942 1.0961
irintensity: 0.9768 1.1047 0.4179 3.4124 1.6140 1.8409 0.7625 0.1410 1.7248 2.3437 2.1095 0.4891 1.8861 0.2171 0.2794 0.2776 2.4296 1.7430 12.7670 22.4741 2.4314 2.0366 3.4518 3.0985 1.8942 5.3982 37.6397 1.0161 61.7738 2.0706 15.7799 2.8945 0.6532 0.2843 18.5016 1.3186 6.2162 39.9693 10.8241 1.1096 0.6324 0.6499 0.2066 10.9636 0.4830 1.8527 1.5543 91.8953 3.3070 1.5409 173.3943 3.5670 5.6140 7.1755 2.5764 4.5060 0.4370 4.1377 16.2863 0.1094 0.8249 4.2349 9.0175 10.4921 6.6757 6.4461 20.1427 7.0069 0.9859 61.9297 29.5319 110.7664 13.6409 59.8261 2.4906 49.8195 27.3982 77.4541 18.9928 45.2289 48.0214 84.5292 23.6356 64.7406 102.0285 51.3485 25.9591 29.4681 32.0452 13.2938 9.4515 20.5653 5.4778
temp: 298.150 k
press: 1.00000 atm
elementType: 8 6 6 6 6 6 6 6 6 6 6 6 6 6 6 1 1 1 1 1 1 1 1 1 1 1 1 1 1 1 1 1 1
symmnumber: 1
zpe: 742827.9 jmol-1
zpe.correction: 0.282928 hartree
zpe.thermalcorrener: 0.296961 hartree
zpe.thermalcorrenthalpy: 0.297905 hartree
zpe.thermalcorrgfe: 0.241942 hartree
zpe.sumelectzpe: -618.359951 hartree
zpe.sumelectthermal: -618.345918 hartree
zpe.sumelectthermalent: -618.344974 hartree
zpe.sumelectthermalfe: -618.400937 hartree
dipole: -0.0208 -1.8103 -0.2212
dipole: 1.8239
quadrupole: -78.9602 -84.3830 -93.8673
quadrupole: -8.5578 -2.1540 0.4207
quadrupole: 6.7766 1.3538 -8.1305 -8.5578 -2.1540 0.4207
hfenergy: -618.6428788 hartree
pointgroup: C01 [X(C14H18O1)]
dipole: 0.0211992 -0.7172765 -0.0015925 debye
polarizability: 242.0328169|15.0809638|146.8476633|-4.1186751|6.1478294|94.7708338 unknown
InChI: InChI=1S/C14H18O/c1-15-14-10-8-13(9-11-14)12-6-4-2-3-5-7-12/h6,8-11H,2-5,7H2,1H3
charge 0 multiplicity 1
33 atoms
O  -4.506149 0.223562 0.374728
C  4.275587 -1.003099 0.038417
C  2.897549 -1.666437 -0.207455
C  4.251888 0.314121 0.85057
C  1.914778 -0.808976 -1.054971
C  3.455141 1.467819 0.171896
C  1.214757 0.311727 -0.282322
C  1.946264 1.327837 0.272691
C  -0.269282 0.25714 -0.12935
C  -1.053493 1.447847 -0.039783
C  -0.965355 -0.979083 -0.060249
C  -2.446256 1.404382 0.129349
C  -2.366495 -1.043966 0.111506
C  -3.112619 0.154997 0.20984
C  -5.239029 -1.04177 0.44357
H  2.424197 -1.915252 0.7634
H  3.071442 -2.626931 -0.733912
H  4.748567 -0.801529 -0.946527
H  4.933672 -1.729976 0.556487
H  5.298588 0.64864 0.999755
H  3.828998 0.12814 1.857673
H  1.161396 -1.467555 -1.522962
H  2.487048 -0.362539 -1.896328
H  3.766052 1.518608 -0.895005
H  3.756956 2.428058 0.630197
H  1.425426 2.083977 0.875742
H  -0.561079 2.42167 -0.13619
H  -0.405415 -1.919642 -0.11228
H  -3.042501 2.320461 0.185086
H  -2.85482 -2.021461 0.170617
H  -6.294477 -0.757414 0.566492
H  -4.913681 -1.650154 1.310232
H  -5.116953 -1.629599 -0.487316
