program: Gaussian 09
title: 000278133
version: EM64L-G09RevD.01
frameworkgroup: C1[X(C15H23NO)]
method: RPBEPBE
basis: SDD
operation: Freq
keyword: #p
keyword: freq=noraman
keyword: PBEPBE/SDD
title: #p freq=noraman PBEPBE/SDD
converged: YES YES NO NO
title: Mulliken charges:
elementType: O N C C C C C C C C C C C C C C C H H H H H H H H H H H H H H H H H H H H H H H
charge: -0.420761 -0.245504 -0.283001 -0.138587 -0.408395 -0.404790 -0.413276 -0.403734 -0.407367 0.525860 0.152827 -0.380188 -0.339334 -0.277053 -0.247545 -0.631647 -0.630422 0.199119 0.217842 0.214344 0.196736 0.223396 0.184444 0.192646 0.204292 0.197734 0.204444 0.202178 0.202488 0.222224 0.318658 0.254293 0.222626 0.225402 0.162276 0.249623 0.217659 0.189915 0.215226 0.235352
chargesum: 0.00000
title: Mulliken charges with hydrogens summed into heavy atoms:
elementType: O N C C C C C C C C C C C C C C C
charge: -0.102103 -0.245504 -0.083882 0.079255 0.002685 0.003049 -0.016339 -0.001556 -0.002701 0.525860 0.152827 -0.157964 -0.085041 -0.054427 -0.022142 -0.002088 0.010071
polarizability: 1.99258627e+02 5.15019116e+00 1.72179487e+02 -1.09495724e+00 1.88890940e+00 1.28041254e+02
1716.lowfreq: -12.5106 -0.0004 -0.0003 0.0006 4.2775 14.1426 38.8911 45.5805 60.1966
frequency: 38.0996 45.5204 60.1272 71.2415 100.4175 124.6196 138.6865 166.5153 179.5674 197.9876 215.8035 233.2233 243.7849 265.1544 296.5282 307.2359 335.9677 346.5893 363.3257 378.0609 402.6189 477.5988 488.0479 516.8435 519.4302 546.1340 568.2769 615.6534 717.9821 744.8220 751.9418 762.1549 777.7616 814.2303 840.7997 868.3800 892.1764 906.9951 942.1253 953.7890 954.8414 970.4814 986.8382 993.6545 1018.0702 1038.2297 1052.4870 1057.3143 1072.5415 1087.8087 1090.5034 1117.4767 1128.1944 1137.0952 1140.0386 1149.3607 1163.0822 1180.2123 1190.2319 1196.7360 1228.3430 1230.9528 1259.4299 1261.0735 1272.4439 1288.6556 1308.3600 1324.2710 1329.8153 1330.6502 1340.0618 1352.6475 1353.6232 1355.7789 1366.2099 1371.0932 1423.1677 1430.4034 1441.7486 1455.2163 1462.6747 1465.1967 1466.8306 1467.2224 1475.7985 1481.7307 1482.1933 1485.1753 1506.4483 1577.5340 1606.4881 2791.8804 2850.9705 2962.1235 2964.3842 2969.8192 2974.8540 2978.6391 2980.1620 2986.1336 2987.7674 3009.0962 3021.9249 3025.1675 3033.7550 3040.2420 3044.9255 3072.6515 3082.5023 3107.8264 3126.7086 3143.2332 3160.4858 3528.1945
redmass: 3.6029 3.1243 3.1602 3.1844 2.6756 3.1539 2.9754 2.5189 1.2268 3.1260 1.1523 3.7335 2.0386 1.9771 1.1899 2.3499 3.3882 3.5006 3.5790 2.3478 4.2473 2.7136 3.3643 3.7143 2.8052 2.6750 3.2640 5.1411 3.3848 1.7915 1.8433 1.7920 1.8582 2.9923 2.4391 1.6325 2.0682 2.4035 2.2714 1.8264 2.1306 2.8408 1.3279 2.0727 1.8978 2.0595 2.3231 1.4250 2.3009 1.2179 2.3368 1.9727 1.3614 2.0437 1.4186 1.6286 1.1329 1.1998 1.5700 1.4590 1.5605 4.8474 1.5856 1.2271 1.3440 1.2922 1.2004 1.4116 2.2859 1.4775 1.4082 1.4033 1.6784 1.4718 1.2827 2.6803 1.1211 1.6130 1.4062 1.0711 1.0822 1.0926 1.0756 1.2576 1.6674 1.1037 1.0851 1.0529 1.1926 6.5310 6.3772 1.0612 1.0583 1.0601 1.0651 1.0625 1.0626 1.0666 1.0705 1.0767 1.0780 1.0974 1.0918 1.0947 1.0990 1.0997 1.0977 1.0966 1.0962 1.0871 1.0877 1.0937 1.1004 1.0658
irintensity: 0.1495 0.5497 0.0490 0.9299 1.2223 1.1001 1.7449 3.2242 1.3737 9.0379 20.8245 4.6675 2.0944 0.9093 125.6543 3.1691 1.5378 32.1005 15.5204 3.7042 14.3520 0.4367 1.5910 0.7051 8.2621 13.8942 1.6601 1.1436 4.7763 10.6728 15.2312 22.6461 25.9821 2.4156 12.7717 3.3907 6.0094 15.7420 4.2603 9.2773 15.1454 52.2519 0.1301 1.1454 4.6397 14.4257 2.2430 7.6421 15.4023 4.3929 12.2192 6.2197 4.7029 5.8158 9.6402 15.2287 3.0258 5.2827 3.9235 1.5047 11.9999 28.7846 2.1185 1.5227 0.2102 9.1978 2.5090 0.0931 7.0947 2.0891 3.1178 0.4451 8.6420 3.7577 18.1236 1.8529 4.8366 3.5940 18.3154 7.7182 14.6642 2.4961 1.6730 25.8808 22.7882 8.4738 25.3213 7.5333 19.6441 0.5933 2.6590 175.5698 156.5546 11.2817 15.4508 50.7793 18.9549 39.9629 100.6613 39.8694 35.5395 15.0076 37.1829 43.7772 45.5821 73.4326 73.3704 21.9983 23.3906 15.1798 7.8214 30.0975 28.5001 10.5429
temp: 298.150 k
press: 1.00000 atm
elementType: 8 7 6 6 6 6 6 6 6 6 6 6 6 6 6 6 6 1 1 1 1 1 1 1 1 1 1 1 1 1 1 1 1 1 1 1 1 1 1 1
symmnumber: 1
zpe: 915060.1 jmol-1
zpe.correction: 0.348528 hartree
zpe.thermalcorrener: 0.366191 hartree
zpe.thermalcorrenthalpy: 0.367135 hartree
zpe.thermalcorrgfe: 0.303323 hartree
zpe.sumelectzpe: -714.018024 hartree
zpe.sumelectthermal: -714.000361 hartree
zpe.sumelectthermalent: -713.999417 hartree
zpe.sumelectthermalfe: -714.063230 hartree
dipole: 1.3649 1.2674 -1.6434
dipole: 2.4839
quadrupole: -99.7550 -96.4037 -111.3329
quadrupole: -0.4871 -0.4549 3.4760
quadrupole: 2.7422 6.0935 -8.8357 -0.4871 -0.4549 3.4760
hfenergy: -714.3665524 hartree
pointgroup: C01 [X(C15H23N1O1)]
dipole: 0.5395586 -0.4631452 0.6703781 debye
polarizability: 199.4433473|-4.4598815|172.0270679|2.1963908|0.3459826|128.0089526 unknown
InChI: InChI=1S/C15H23NO/c1-16(2)14-10-7-6-8-12(14)13-9-4-3-5-11-15(13)17/h6-8,10,13,15,17H,3-5,9,11H2,1-2H3
charge 0 multiplicity 1
40 atoms
O  0.649062 -0.122917 -2.406134
N  -1.894335 -1.794987 0.100598
C  0.625794 -0.088078 0.081395
C  1.386355 0.342848 -1.207351
C  1.363089 0.262057 1.413517
C  2.865245 -0.103416 -1.304058
C  2.653652 -0.557958 1.666747
C  3.817315 0.656362 -0.345024
C  3.954687 0.047281 1.075968
C  -0.793876 0.488626 0.093757
C  -1.952895 -0.346028 0.103642
C  -0.975394 1.896237 0.120516
C  -3.241437 0.248017 0.121212
C  -2.25967 2.478043 0.139903
C  -3.405199 1.649391 0.136461
C  -1.650992 -2.49387 -1.161371
C  -1.491363 -2.491199 1.326795
H  0.550299 -1.194103 0.046289
H  1.347275 1.443463 -1.308553
H  0.647441 0.066951 2.235266
H  1.58285 1.348019 1.456148
H  3.166646 0.08696 -2.351547
H  2.945728 -1.199521 -1.14556
H  2.50192 -1.580362 1.263734
H  2.798323 -0.684634 2.757766
H  3.466254 1.705891 -0.271244
H  4.825637 0.712105 -0.799054
H  4.333435 0.834346 1.758487
H  4.728715 -0.746174 1.061561
H  -0.095162 2.551527 0.117977
H  0.542433 -1.107577 -2.342493
H  -4.107786 -0.422471 0.125541
H  -2.367095 3.568644 0.154853
H  -4.409227 2.088372 0.148588
H  -0.564499 -2.670144 -1.390432
H  -2.082207 -1.917572 -1.996861
H  -2.133395 -3.491991 -1.142418
H  -0.385344 -2.609125 1.454575
H  -1.931638 -3.508372 1.338788
H  -1.875645 -1.946441 2.206316
