program: Gaussian 09
title: 000278129
version: EM64L-G09RevD.01
frameworkgroup: C1[X(C14H20OS)]
method: RPBEPBE
basis: SDD
operation: Freq
keyword: #p
keyword: freq=noraman
keyword: PBEPBE/SDD
title: #p freq=noraman PBEPBE/SDD
converged: YES YES NO NO
title: Mulliken charges:
elementType: S O C C C C C C C C C C C C C C H H H H H H H H H H H H H H H H H H H H
charge: 0.117528 -0.445194 -0.333760 -0.091865 -0.401256 -0.394704 -0.421270 -0.405148 -0.410360 0.592881 -0.437824 -0.365871 -0.192658 -0.260828 -0.251285 -0.839594 0.228080 0.217162 0.213247 0.186156 0.223437 0.191574 0.199993 0.204243 0.195027 0.204838 0.200446 0.203782 0.332043 0.228706 0.245847 0.226945 0.230516 0.260867 0.252929 0.295368
chargesum: 0.00000
title: Mulliken charges with hydrogens summed into heavy atoms:
elementType: S O C C C C C C C C C C C C C C
charge: 0.117528 -0.113151 -0.105680 0.125297 -0.001853 0.020308 -0.017034 -0.005283 -0.006132 0.592881 -0.437824 -0.137165 0.053190 -0.033883 -0.020770 -0.030429
polarizability: 2.01431255e+02 9.88357277e-01 1.77004012e+02 2.68251390e+00 -1.09014505e+01 1.22199878e+02
1716.lowfreq: -13.5969 -0.0009 0.0015 0.0018 5.8643 17.6373 51.1362 54.2956 71.7527
frequency: 50.7485 54.1384 71.7251 84.5600 114.6100 127.8758 156.1305 169.5180 180.9321 210.7937 245.0481 264.2715 277.4135 321.6362 342.2535 356.4990 366.8881 400.8265 405.9252 449.8648 474.6552 495.7333 527.8593 553.8908 617.3694 637.7129 675.1299 731.2799 746.5406 749.5047 762.0948 814.7891 842.8199 867.0534 886.1207 910.8057 946.6368 950.6261 971.3435 978.9700 985.8218 993.3261 1000.1715 1018.7240 1020.7421 1047.4471 1051.6343 1085.6087 1110.9018 1126.6470 1138.7058 1156.1816 1174.1648 1176.7627 1195.0606 1199.8494 1234.2705 1259.8367 1265.3387 1272.4284 1295.6903 1308.7843 1329.1076 1332.7631 1336.7268 1341.6176 1350.4066 1352.2442 1357.0543 1370.4437 1386.3856 1423.5604 1444.9636 1459.7141 1463.2907 1465.7128 1468.4557 1469.4301 1481.5054 1483.2465 1574.0045 1597.9190 2962.5451 2965.2416 2967.6439 2976.9187 2977.8246 2980.0723 3000.4772 3010.0397 3011.0932 3025.2624 3035.9055 3040.8760 3046.5713 3124.2483 3133.5009 3136.0956 3139.7264 3145.7715 3163.2258 3436.7512
redmass: 3.4591 3.7477 3.7116 3.6168 3.2816 2.5998 1.6976 1.7791 3.8196 3.4586 2.2602 2.3085 4.3005 3.8024 3.3635 2.9991 1.3713 3.1172 4.1947 3.3402 3.3731 2.3545 2.8936 3.0460 5.1035 7.0195 5.5280 2.8963 1.6586 1.6198 1.4544 2.9101 2.3829 1.4946 2.0519 2.3507 1.9105 1.5419 1.6331 1.8353 1.3306 1.3497 1.9281 3.3371 2.4223 2.2788 2.1707 2.4137 1.9890 2.0855 2.4662 1.2284 1.0740 1.2435 1.7625 1.3965 1.3365 1.2051 1.5441 1.2798 1.2630 1.2120 1.3818 1.3806 1.2090 1.2697 1.3340 1.4151 1.4251 4.8343 1.2471 2.0724 1.0830 2.2561 1.0828 1.0848 1.0572 1.0841 1.0854 1.0836 6.1202 6.3462 1.0601 1.0787 1.0650 1.0635 1.0632 1.0666 1.0854 1.0284 1.0959 1.1000 1.0993 1.1010 1.0994 1.0846 1.0890 1.1039 1.1064 1.0945 1.1010 1.0665
irintensity: 0.6724 3.1504 2.2003 8.8737 2.6733 2.2096 2.6981 2.4327 0.4263 3.4555 0.8540 0.7940 3.5353 1.6434 11.9902 2.4435 126.8917 66.0194 10.7723 15.1973 8.2203 5.0778 2.1244 5.7747 1.3938 2.3355 4.9016 1.2300 2.7391 38.2733 46.7786 0.7557 11.5044 2.1997 6.9950 12.2919 5.5074 5.5784 35.1884 22.4654 0.1195 10.9692 1.1422 11.3682 8.3865 3.8574 2.8127 9.7032 3.8856 0.8995 1.1188 9.8823 0.6647 1.1506 0.0320 2.2128 1.9445 1.7849 3.5690 0.8910 5.9382 1.1870 1.7930 2.3060 9.0066 0.3858 1.1810 0.5681 0.7031 0.7016 17.0063 7.2517 11.3051 36.7379 10.4473 0.9437 15.4477 5.8007 7.4388 22.0278 0.8023 4.1678 14.5428 0.4570 34.4584 28.6941 46.7727 9.5509 41.6512 31.4516 10.8807 65.3054 65.0530 70.3486 52.1033 2.0299 6.6637 7.6540 7.5993 28.6011 28.2621 87.0040
temp: 298.150 k
press: 1.00000 atm
elementType: 16 8 6 6 6 6 6 6 6 6 6 6 6 6 6 6 1 1 1 1 1 1 1 1 1 1 1 1 1 1 1 1 1 1 1 1
symmnumber: 1
zpe: 805559.5 jmol-1
zpe.correction: 0.306821 hartree
zpe.thermalcorrener: 0.323165 hartree
zpe.thermalcorrenthalpy: 0.324109 hartree
zpe.thermalcorrgfe: 0.263288 hartree
zpe.sumelectzpe: -1017.532673 hartree
zpe.sumelectthermal: -1017.516330 hartree
zpe.sumelectthermalent: -1017.515386 hartree
zpe.sumelectthermalfe: -1017.576206 hartree
dipole: 0.1694 1.0192 0.2659
dipole: 1.0669
quadrupole: -93.3356 -99.0083 -112.0980
quadrupole: 1.9505 3.1217 -3.9784
quadrupole: 8.1450 2.4723 -10.6174 1.9505 3.1217 -3.9784
hfenergy: -1017.8394948 hartree
pointgroup: C01 [X(C14H20O1S1)]
dipole: 0.0235164 -0.3873317 -0.1600179 debye
polarizability: 200.9450057|-2.9896092|179.3289991|-4.2734231|-2.5318461|120.3611399 unknown
InChI: InChI=1S/C14H20OS/c1-16-14-10-6-5-8-12(14)11-7-3-2-4-9-13(11)15/h5-6,8,10-11,13,15H,2-4,7,9H2,1H3
charge 0 multiplicity 1
36 atoms
S  -1.79056 2.165523 -0.91432
O  0.371716 1.626856 1.507631
C  0.638998 0.06306 -0.40563
C  1.216465 0.537439 0.964978
C  1.529242 -0.977567 -1.153126
C  2.689936 1.010309 0.952904
C  2.861043 -0.397862 -1.694972
C  3.719663 -0.131672 0.763941
C  4.059831 -0.46948 -0.712192
C  -0.798871 -0.445135 -0.229898
C  -1.947167 0.367211 -0.453908
C  -1.025627 -1.789458 0.174379
C  -3.253332 -0.162371 -0.327413
C  -2.324394 -2.314993 0.334708
C  -3.449064 -1.50086 0.073482
C  -2.627873 2.929423 0.608814
H  0.603456 0.963292 -1.054584
H  1.115152 -0.281416 1.704843
H  0.931688 -1.364339 -2.00087
H  1.742917 -1.850932 -0.504905
H  2.848277 1.499084 1.932547
H  2.829149 1.798296 0.184807
H  2.688858 0.654007 -1.999183
H  3.141823 -0.935843 -2.62163
H  3.332895 -1.036636 1.276328
H  4.659377 0.128221 1.288625
H  4.502226 -1.485423 -0.747615
H  4.846366 0.222185 -1.074981
H  0.077954 2.189032 0.738512
H  -0.163253 -2.437471 0.365772
H  -4.11722 0.474699 -0.546785
H  -2.458281 -3.355295 0.651534
H  -4.464132 -1.900491 0.17319
H  -3.697849 2.675866 0.617037
H  -2.501399 4.019614 0.514787
H  -2.129107 2.555327 1.515892
