program: Gaussian 09
title: 000278145
version: EM64L-G09RevD.01
frameworkgroup: C1[X(C18H13N)]
method: RPBEPBE
basis: SDD
operation: Freq
keyword: #pfreq=noraman
keyword: PBEPBE/SDD
title: #p freq=noraman PBEPBE/SDD
converged: YES YES NO NO
title: Mulliken charges:
elementType: N C C C C C C C C C C C C C C C C C C H H H H H H H H H H H H H
charge: -0.027260 0.440286 -0.708821 0.178657 0.385411 0.329850 -0.462696 -0.376621 -0.462095 -0.246176 -0.436543 0.215133 -0.370527 -0.262807 -0.243094 -0.362624 -0.230614 -0.233578 -0.276770 0.253399 0.250074 0.240033 0.247666 0.240298 0.228875 0.238609 0.260195 0.229846 0.229900 0.258465 0.234903 0.238624
chargesum: 0.00000
title: Mulliken charges with hydrogens summed into heavy atoms:
elementType: N C C C C C C C C C C C C C C C C C C
charge: -0.027260 0.440286 -0.205347 0.178657 0.385411 0.329850 -0.222663 -0.128955 -0.221797 -0.017301 -0.197934 0.215133 -0.110332 -0.032961 -0.013194 -0.104158 0.004289 0.005045 -0.276770
polarizability: 2.25134647e+02 -1.57155441e+01 1.96401969e+02 1.71033437e+01 5.37254721e-01 1.63789133e+02
1716.lowfreq: -5.8311 -3.4691 -0.0007 -0.0003 0.0005 5.5662 12.5292 32.9314 54.4318
frequency: 11.4925 32.9065 54.4035 113.2707 119.0911 139.8547 177.6650 189.8806 248.0982 278.0024 286.2448 382.7157 405.1430 421.0743 447.6632 463.2769 473.8494 496.3833 508.4400 533.7929 561.0550 571.7006 592.2806 612.9401 653.0993 699.3016 723.2157 740.2853 755.0501 777.9583 784.0404 793.7881 806.1922 820.9824 866.3288 881.3176 886.4564 918.7209 934.9427 963.3233 971.4749 986.0409 995.3736 1002.2615 1023.1147 1040.5306 1047.7699 1074.4878 1090.1591 1150.6142 1172.7485 1176.8769 1181.5818 1183.3173 1196.5127 1212.0905 1238.4713 1251.8157 1271.0902 1280.3066 1316.7226 1374.9160 1380.4392 1407.2170 1419.1592 1432.6935 1441.3554 1456.3787 1463.4493 1476.1948 1518.3558 1573.5867 1590.6764 1599.9457 1607.9579 1633.6940 2169.5674 2978.7028 3024.7534 3119.3138 3121.4444 3128.0904 3133.6836 3134.4228 3146.6933 3149.7941 3156.3177 3156.8431 3164.9997 3172.1497
redmass: 6.1794 4.9732 4.8473 5.8030 6.2945 4.2692 4.1125 5.6118 4.2618 5.9783 2.4564 4.3414 3.8296 2.9141 4.4131 3.7063 3.3388 6.1411 6.1938 3.9873 6.6481 4.5156 6.3394 4.0004 4.1241 3.4979 3.9439 1.4962 2.7757 1.4430 4.2262 2.3334 2.4142 1.9943 2.9299 1.5878 1.7922 1.5608 1.8241 1.3774 1.4304 1.3654 1.3500 1.3506 3.0919 2.3878 2.6892 2.4536 2.3837 1.4263 1.2045 1.1435 1.2107 1.5449 1.2154 2.7785 1.8391 1.6524 1.5762 1.7435 1.7279 4.2978 2.2986 3.0018 5.2719 2.1253 2.2690 2.4626 1.3277 2.0639 3.8397 6.4883 7.5229 5.3272 6.0568 6.5594 12.6345 1.0606 1.0987 1.0867 1.0867 1.0910 1.0882 1.0859 1.0895 1.0944 1.0990 1.0953 1.1003 1.1009
irintensity: 1.3955 0.2669 0.7456 2.5830 2.6005 0.2180 2.2762 0.0759 1.7910 1.5471 1.1717 0.2034 1.4771 6.1769 4.5050 3.8210 0.3586 2.5225 0.3400 6.9602 1.3532 3.1914 1.5492 4.8715 2.7483 4.4107 5.5701 5.1121 1.5140 65.6926 7.6024 53.7554 53.2585 21.5352 0.6607 3.3688 3.2980 1.7239 1.1312 1.5664 1.6810 2.6496 0.6428 0.1015 8.3755 7.2508 0.2668 1.4862 11.3745 1.5173 3.3935 0.3620 0.4834 0.9087 1.4723 2.7524 3.7439 2.0932 2.1934 0.1268 1.7053 8.6374 5.8061 4.6876 1.3558 10.6404 5.7582 1.5589 23.5381 17.6687 10.0494 2.2202 0.9960 6.7311 11.3835 0.3192 33.3288 11.9855 5.4985 5.0280 1.3336 17.9867 5.0258 0.6281 3.4675 33.9839 31.5031 19.3766 21.5197 20.0696
temp: 298.150 k
press: 1.00000 atm
elementType: 7 6 6 6 6 6 6 6 6 6 6 6 6 6 6 6 6 6 6 1 1 1 1 1 1 1 1 1 1 1 1 1
symmnumber: 1
zpe: 658678.1 jmol-1
zpe.correction: 0.250877 hartree
zpe.thermalcorrener: 0.265774 hartree
zpe.thermalcorrenthalpy: 0.266718 hartree
zpe.thermalcorrgfe: 0.206814 hartree
zpe.sumelectzpe: -747.194453 hartree
zpe.sumelectthermal: -747.179556 hartree
zpe.sumelectthermalent: -747.178612 hartree
zpe.sumelectthermalfe: -747.238516 hartree
dipole: 1.5258 -1.3044 4.0163
dipole: 4.4900
quadrupole: -104.1021 -102.4322 -118.5222
quadrupole: 1.2821 -11.6827 4.8087
quadrupole: 4.2501 5.9199 -10.1700 1.2821 -11.6827 4.8087
hfenergy: -747.44533 hartree
pointgroup: C01 [X(C18H13N1)]
dipole: -0.4971281 -0.737601 1.5262024 debye
polarizability: 216.8005816|-2.3998995|178.8327541|-25.689289|20.8272603|189.6924134 unknown
InChI: InChI=1S/C18H13N/c19-13-17-8-2-1-7-15(17)12-16-10-5-9-14-6-3-4-11-18(14)16/h1-11H,12H2
charge 0 multiplicity 1
32 atoms
N  3.160387 0.709748 -3.168149
C  -0.552064 1.176798 0.282224
C  0.825991 1.135456 -0.364812
C  -1.603485 0.275839 -0.137779
C  -2.902201 0.356111 0.505425
C  1.689492 -0.075724 0.001598
C  -0.81582 2.106057 1.29682
C  -1.419288 -0.698546 -1.17628
C  -3.120322 1.323039 1.542315
C  -2.095139 2.184432 1.930565
C  -3.949417 -0.531207 0.089009
C  2.740986 -0.509646 -0.866698
C  1.513352 -0.767726 1.222641
C  -2.45885 -1.548421 -1.562266
C  -3.736385 -1.467219 -0.924407
C  3.578718 -1.603298 -0.509122
C  2.344113 -1.852706 1.578641
C  3.380407 -2.273784 0.712803
C  2.969031 0.158043 -2.123378
H  1.380957 2.047271 -0.067549
H  0.736771 1.193622 -1.466948
H  -0.022043 2.794344 1.611754
H  -0.448326 -0.779845 -1.674932
H  -4.105649 1.375701 2.02063
H  -2.262207 2.926086 2.719055
H  -4.926511 -0.459381 0.581882
H  0.708353 -0.453835 1.895096
H  -2.297773 -2.282579 -2.359284
H  -4.54316 -2.139602 -1.235986
H  4.37366 -1.913889 -1.19455
H  2.182124 -2.370889 2.53013
H  4.023997 -3.11605 0.986554
